profile-image

drasey

Dennis Rasey
X2 1.1.0 Text Editors
103 comments
Score 52%
52 Likes
48 Dislikes
Jan 29 2012
Up till you mentioned that the git version probably isn't ready for testing, I was simply interested in playing around with "what's changed" (and making sure I could build it when the time came) Jan 17 2012
Up till you mentioned that the git version probably isn't ready for testing, I was simply interested in playing around with "what's changed" (and making sure I could build it when the time came) Jan 17 2012
Up till you mentioned that the git version probably isn't ready for testing, I was simply interested in playing around with "what's changed" (and making sure I could build it when the time came) Jan 17 2012
ah, 'make clean' did the trick (sorry, didn't think about trying that) Jan 17 2012
Thanks for the quick reply!

The compile error is now gone, but for some reason, I'm getting a 64bit binary being built (I'm on a 32bit system)


drasey@xxx:~/download/x2: file src/x2
src/x2: ELF 64-bit LSB executable, x86-64, version 1 (SYSV), dynamically linked (uses shared libs), for GNU/Linux 2.6.27, BuildID[sha1]=0x2e6e02e55c34cbc9f7ba208c1781f3f9bdb4cd2d, not stripped

Jan 17 2012
I'm seeing the following error when trying to compile under Debian testing

I can compile the release version w/o issues (1.0.9)

No errors during ./configure



make all

make -C src all
make[1]: Entering directory `/home/drasey/download/x2/svn/x2/src'
gcc -Wall -g -O0 -o x2 main.c `pkg-config --libs --cflags vte gtksourceview-2.0`
In file included from main.c:19:0:
callbacks.c: In function 'New':
callbacks.c:135:9: warning: 'vte_terminal_fork_command' is deprecated (declared at /usr/include/vte-0.0/vte/vtedeprecated.h:82) [-Wdeprecated-declarations]
In file included from main.c:19:0:
callbacks.c: In function 'destroy':
callbacks.c:534:2: warning: passing argument 1 of 'gtk_button_box_set_layout' from incompatible pointer type [enabled by default]
/usr/include/gtk-2.0/gtk/gtkbbox.h:71:19: note: expected 'struct GtkButtonBox *' but argument is of type 'struct GtkWidget *'
callbacks.c: In function 'drag_data_received_handler':
callbacks.c:578:16: warning: pointer targets in initialization differ in signedness [-Wpointer-sign]
main.c: At top level:
main.c:20:23: fatal error: templates.c: No such file or directory
compilation terminated.
make[1]: *** [x2] Error 1
make[1]: Leaving directory `/home/drasey/download/x2/svn/x2/src'
make: *** [all] Error 2

Jan 16 2012