profile-image

LazyKent

Kyrill Detinov Moscow, Russian Federation
Bluecurve GNOME/MATE Theme 1.2 GTK2 Themes
15 comments
Score 67%
67 Likes
33 Dislikes
Jul 31 2017
Found it in xfce-look.org. What about Xfce? Dec 07 2013
qMetro 0.7.1 Utilities
21 comments
Score 66%
66 Likes
34 Dislikes
Dec 31 2013
Спасибо. Теперь без ошибок собралось.

> p.s.> svn110 это 0.6.7 но местами сыроват.

Ну, я не дождался тарбола с исходниками. Решил собрать последнюю версию для openSUSE из SVN.
Диалог "О программе", однако, показывает 0.6.6.
Пока обозначил версию пакета 0.6.6+svn.110.
Aug 30 2013
Компилятор ругается. Версия svn110.

I: Program returns random data in a function
E: qmetro no-return-in-nonvoid-function src/mapview/mapview.cpp:2529

g++ -c -pipe -fmessage-length=0 -grecord-gcc-switches -O2 -Wall -D_FORTIFY_SOURCE=2 -fstack-protector -funwind-tables -fasynchronous-unwind-tables -g -O2 -Wall -W -D_REENTRANT -DVERSION=\"0.6.6\" -DQT_NO_DEBUG -DQT_GUI_LIB -DQT_CORE_LIB -DQT_SHARED -I/usr/share/qt4/mkspecs/default -I. -I/usr/include/QtCore -I/usr/include/QtGui -I/usr/include -Isrc/zlib -I. -I. -o completer.o src/completer.cpp
src/mapview/mapview.cpp: In member function 'void TMapView::defaultConfig()':
src/mapview/mapview.cpp:2172:23: warning: comparison between 'enum QLocale::Country' and 'enum QLocale::Language' [-Wenum-compare]
if(country==QLocale::Czech) city="Praha"; else
^
src/mapview/mapview.cpp:2173:23: warning: comparison between 'enum QLocale::Country' and 'enum QLocale::Language' [-Wenum-compare]
if(country==QLocale::Spanish) city="Madrid"; else
^
src/mapview/mapview.cpp: In member function 'virtual bool TMapView::viewportEvent(QEvent*)':
src/mapview/mapview.cpp:2529:1: warning: control reaches end of non-void function [-Wreturn-type]
}
^

Что нужно добавить?
Aug 29 2013
Спасибо! Всё получилось.

Добавьте, пожалуйста, в описание ссылку на пакеты для openSUSE.
http://software.opensuse.org/search?q=qmetro
Aug 11 2012
Компилятор выдаёт warning:

src/completer.cpp: In member function 'QList<QPair<QString, QColor> > TCompleter::filterList(QList<QPair<QString, QColor> >, QString)':
src/completer.cpp:199:1: warning: control reaches end of non-void function [-Wreturn-type]

У меня из-за этого не собирается пакет в OBS. Вот здесь полный лог:
https://build.opensuse.org/package/rawlog?arch=x86_64&package=qmetro&project=home%3ALazy_Kent&repository=openSUSE_Factory

Дайте, пожалуйста, патч.
Aug 10 2012
Вполне правильное место для централизованной установки. Права нельзя трогать.
Я вообще собираю отдельный пакет с картами и регулярно обновляю.
Aug 10 2012
PdfViewer (app + library) 0.7 Qt Stuff
50 comments
Score 68%
68 Likes
32 Dislikes
Sep 30 2012
Thumbnails aren't displayed in the thumbnails panel.
Jul 11 2012
Thanks! Finally built it.
Using 'qmake LIB_INSTALL_DIR=%{_libdir}'.

Not tested yet with cmake.

One note: please remove 20x20 icon. This size is incorrect for hicolor-icon-theme.
Prooflink: http://cgit.freedesktop.org/xdg/default-icon-theme/tree/Makefile.in
Jun 07 2012
Wrong place for pdfview.h.
Should be include instead of includes.
Jun 06 2012
Libraries are installed in lib. Should be lib64 in x86_64 systems.
Jun 06 2012
The same error.

I modified app/src/CMakeLists.txt:110
target_link_libraries(pdfviewer ${QT_LIBRARIES} ${POPPLER_QT4_LIBRARIES} -lz)

Then it compiled, but failed install.

-- Installing: /home/abuild/rpmbuild/BUILDROOT/pdfviewer-0.5.1-0.x86_64/usr/bin/pdfviewer
CMake Error at app/translations/src/cmake_install.cmake:38 (FILE):
file INSTALL cannot find
"/home/abuild/rpmbuild/BUILD/pdfviewer-0.5.1/build/app/translations/src/CMakeFiles/CMakeRelink.dir/pdfviewer".
Call Stack (most recent call first):
app/translations/cmake_install.cmake:37 (INCLUDE)
app/cmake_install.cmake:38 (INCLUDE)
cmake_install.cmake:37 (INCLUDE)

make: *** [install] Error 1

Built with qmake successfully though.
Jun 06 2012
I can't compile version 0.4.
Error:

/usr/lib64/gcc/x86_64-suse-linux/4.6/../../../../x86_64-suse-linux/bin/ld: CMakeFiles/pdfviewer.dir/synctex/synctex_parser.c.o: undefined reference to symbol 'gzclose'
/usr/lib64/gcc/x86_64-suse-linux/4.6/../../../../x86_64-suse-linux/bin/ld: note: 'gzclose' is defined in DSO /lib64/libz.so.1 so try adding it to the linker command line
/lib64/libz.so.1: could not read symbols: Invalid operation
collect2: ld returned 1 exit status

Apr 21 2012
Russian translation isn't compiled and installed.

I tryed to add 'ru' to translations.pri
LANGUAGES = ru fr # list all the languages here
This doesn't help.
Apr 06 2012
X2 1.1.0 Text Editors
103 comments
Score 52%
52 Likes
48 Dislikes
Jan 29 2012
Where is a project site?
http://rockcomputing.co.uk/ doesn't work.
Feb 12 2012
It still crashes.

% gdb x2
(gdb) run
Starting program: /usr/bin/x2
(x2:3386): GLib-CRITICAL **: g_io_channel_write_chars: assertion `channel != NULL' failed

(x2:3386): GLib-CRITICAL **: g_io_channel_write_chars: assertion `channel != NULL' failed

(x2:3386): GLib-CRITICAL **: g_io_channel_write_chars: assertion `channel != NULL' failed

(x2:3386): GLib-CRITICAL **: g_io_channel_write_chars: assertion `channel != NULL' failed

(x2:3386): GLib-CRITICAL **: g_io_channel_write_chars: assertion `channel != NULL' failed

(x2:3386): GLib-CRITICAL **: g_io_channel_write_chars: assertion `channel != NULL' failed

(x2:3386): GLib-CRITICAL **: g_io_channel_write_chars: assertion `channel != NULL' failed

(x2:3386): GLib-CRITICAL **: g_io_channel_write_chars: assertion `channel != NULL' failed

(x2:3386): GLib-CRITICAL **: g_io_channel_close: assertion `channel != NULL' failed

(x2:3386): GLib-CRITICAL **: g_io_channel_read_line: assertion `channel != NULL' failed

(x2:3386): GLib-CRITICAL **: g_io_channel_read_line: assertion `channel != NULL' failed

(x2:3386): GLib-CRITICAL **: g_io_channel_read_line: assertion `channel != NULL' failed

(x2:3386): GLib-CRITICAL **: g_io_channel_read_line: assertion `channel != NULL' failed

(x2:3386): GLib-CRITICAL **: g_io_channel_read_line: assertion `channel != NULL' failed

(x2:3386): GLib-CRITICAL **: g_io_channel_read_line: assertion `channel != NULL' failed

(x2:3386): GLib-CRITICAL **: g_io_channel_read_line: assertion `channel != NULL' failed

(x2:3386): GLib-CRITICAL **: g_io_channel_read_line: assertion `channel != NULL' failed

(x2:3386): GLib-CRITICAL **: g_io_channel_close: assertion `channel != NULL' failed

Program received signal SIGSEGV, Segmentation fault.
0x00007ffff6367702 in strlen () from /lib64/libc.so.6
(gdb) bt
#0 0x00007ffff6367702 in strlen () from /lib64/libc.so.6
#1 0x00007ffff6dd5006 in g_strrstr () from /usr/lib64/libglib-2.0.so.0
#2 0x0000000000408575 in main (argc=1, argv=0x7fffffffdf68) at x2.c:78

Makefile isn't good.
It use hardcoded /usr/lib patch, for x86_64 we need /usr/lib64.
x2: x2.c - in source is X2.c
For install it should use DESTDIR variable: http://www.gnu.org/prep/standards/html_node/DESTDIR.html

Plese add icons
http://standards.freedesktop.org/icon-theme-spec/icon-theme-spec-latest.html#install_icons
and desktop file
http://standards.freedesktop.org/menu-spec/latest/index.html

And yes, I'd like to build packages for openSUSE after testing in different versions.
Sep 28 2011
Thanks for reply.

I don't know how to provide information about all installed software.
I'm running standard openSUSE 11.3 x86_64 installation from http://download.opensuse.org/distribution/11.3/iso/ + actual updates.

Sep 24 2011
Hello. I compiled the program in openSUSE 11.3 x86_64 but it crashes.

% ./X2

(X2:3116): GLib-CRITICAL **: g_io_channel_write_chars: assertion `channel != NULL' failed

(X2:3116): GLib-CRITICAL **: g_io_channel_write_chars: assertion `channel != NULL' failed

(X2:3116): GLib-CRITICAL **: g_io_channel_write_chars: assertion `channel != NULL' failed

(X2:3116): GLib-CRITICAL **: g_io_channel_write_chars: assertion `channel != NULL' failed

(X2:3116): GLib-CRITICAL **: g_io_channel_write_chars: assertion `channel != NULL' failed

(X2:3116): GLib-CRITICAL **: g_io_channel_write_chars: assertion `channel != NULL' failed

(X2:3116): GLib-CRITICAL **: g_io_channel_write_chars: assertion `channel != NULL' failed

(X2:3116): GLib-CRITICAL **: g_io_channel_write_chars: assertion `channel != NULL' failed

(X2:3116): GLib-CRITICAL **: g_io_channel_close: assertion `channel != NULL' failed
*** glibc detected *** ./X2: free(): invalid pointer: 0x000000000060f620 ***
======= Backtrace: =========
/lib64/libc.so.6(+0x73286)[0x7f400efa3286]
/lib64/libc.so.6(cfree+0x6c)[0x7f400efa802c]
./X2[0x408090]
./X2[0x4081fb]
/lib64/libc.so.6(__libc_start_main+0xfd)[0x7f400ef4eb7d]
./X2[0x404a39]
======= Memory map: ========
00400000-0040a000 r-xp 00000000 09:00 12501196 /home/kent/rpmbuild/BUILD-osc/openSUSE_11.3-x86_64/usr/src/packages/BUILDROOT/x2-1.0.1-0.x86_64/usr/bin/X2
0060a000-0060b000 r--p 0000a000 09:00 12501196 /home/kent/rpmbuild/BUILD-osc/openSUSE_11.3-x86_64/usr/src/packages/BUILDROOT/x2-1.0.1-0.x86_64/usr/bin/X2
0060b000-0060c000 rw-p 0000b000 09:00 12501196 /home/kent/rpmbuild/BUILD-osc/openSUSE_11.3-x86_64/usr/src/packages/BUILDROOT/x2-1.0.1-0.x86_64/usr/bin/X2
0060c000-00652000 rw-p 00000000 00:00 0 [heap]
7f4004000000-7f4004021000 rw-p 00000000 00:00 0
7f4004021000-7f4008000000 ---p 00000000 00:00 0
7f400951c000-7f4009531000 r-xp 00000000 08:22 280578 /lib64/libgcc_s.so.1
7f4009531000-7f4009730000 ---p 00015000 08:22 280578 /lib64/libgcc_s.so.1
7f4009730000-7f4009731000 r--p 00014000 08:22 280578 /lib64/libgcc_s.so.1
7f4009731000-7f4009732000 rw-p 00015000 08:22 280578 /lib64/libgcc_s.so.1
7f4009753000-7f400977e000 r--p 00000000 08:22 207098 /usr/share/locale/ru/LC_MESSAGES/libc.mo
7f400977e000-7f400978a000 r-xp 00000000 08:22 122529 /lib64/libnss_files-2.11.2.so
7f400978a000-7f4009989000 ---p 0000c000 08:22 122529 /lib64/libnss_files-2.11.2.so
7f4009989000-7f400998a000 r--p 0000b000 08:22 122529 /lib64/libnss_files-2.11.2.so
7f400998a000-7f400998b000 rw-p 0000c000 08:22 122529 /lib64/libnss_files-2.11.2.so
7f400998b000-7f4009995000 r-xp 00000000 08:22 124638 /lib64/libnss_nis-2.11.2.so
7f4009995000-7f4009b94000 ---p 0000a000 08:22 124638 /lib64/libnss_nis-2.11.2.so
7f4009b94000-7f4009b95000 r--p 00009000 08:22 124638 /lib64/libnss_nis-2.11.2.so
7f4009b95000-7f4009b96000 rw-p 0000a000 08:22 124638 /lib64/libnss_nis-2.11.2.so
7f4009b96000-7f4009bab000 r-xp 00000000 08:22 108766 /lib64/libnsl-2.11.2.so
7f4009bab000-7f4009daa000 ---p 00015000 08:22 108766 /lib64/libnsl-2.11.2.so
7f4009daa000-7f4009dab000 r--p 00014000 08:22 108766 /lib64/libnsl-2.11.2.so
7f4009dab000-7f4009dac000 rw-p 00015000 08:22 108766 /lib64/libnsl-2.11.2.so
7f4009dac000-7f4009dae000 rw-p 00000000 00:00 0
7f4009dae000-7f4009db5000 r-xp 00000000 08:22 121950 /lib64/libnss_compat-2.11.2.so
7f4009db5000-7f4009fb5000 ---p 00007000 08:22 121950 /lib64/libnss_compat-2.11.2.so
7f4009fb5000-7f4009fb6000 r--p 00007000 08:22 121950 /lib64/libnss_compat-2.11.2.so
7f4009fb6000-7f4009fb7000 rw-p 00008000 08:22 121950 /lib64/libnss_compat-2.11.2.so
7f4009fb7000-7f4009fb9000 r-xp 00000000 08:22 51305 /usr/lib64/libXau.so.6.0.0
7f4009fb9000-7f400a1b9000 ---p 00002000 08:22 51305 /usr/lib64/libXau.so.6.0.0
7f400a1b9000-7f400a1ba000 r--p 00002000 08:22 51305 /usr/lib64/libXau.so.6.0.0
7f400a1ba000-7f400a1bb000 rw-p 00003000 08:22 51305 /usr/lib64/libXau.so.6.0.0
7f400a1bb000-7f400a1c3000 r-xp 00000000 08:22 125320 /lib64/librt-2.11.2.so
7f400a1c3000-7f400a3c2000 ---p 00008000 08:22 125320 /lib64/librt-2.11.2.so
7f400a3c2000-7f400a3c3000 r--p 00007000 08:22 125320 /lib64/librt-2.11.2.so
7f400a3c3000-7f400a3c4000 rw-p 00008000 08:22 125320 /lib64/librt-2.11.2.so
7f400a3c4000-7f400a3eb000 r-xp 00000000 08:22 41417 /lib64/libexpat.so.1.5.2
7f400a3eb000-7f400a5eb000 ---p 00027000 08:22 41417 /lib64/libexpat.so.1.5.2
7f400a5eb000-7f400a5ed000 r--p 00027000 08:22 41417 /lib64/libexpat.so.1.5.2
7f400a5ed000-7f400a5ee000 rw-p 00029000 08:22 41417 /lib64/libexpat.so.1.5.2
7f400a5ee000-7f400a5f5000 r-xp 00000000 08:22 130369 /usr/lib64/libxcb-render.so.0.0.0
7f400a5f5000-7f400a7f5000 ---p 00007000 08:22 130369 /usr/lib64/libxcb-render.so.0.0.0
7f400a7f5000-7f400a7f6000 r--p 00007000 08:22 130369 /usr/lib64/libxcb-render.so.0.0.0
7f400a7f6000-7f400a7f7000 rw-p 00008000 08:22 130369 /usr/lib64/libxcb-render.so.0.0.0
7f400a7f7000-7f400a7fa000 r-xp 00000000 08:22 131048 /usr/lib64/libxcb-render-util.so.0.0.0
7f400a7fa000-7f400a9f9000 ---p 00003000 08:22 131048 /usr/lib64/libxcb-render-util.so.0.0.0
7f400a9f9000-7f400a9fa000 r--p 00002000 08:22 131048 /usr/lib64/libxcb-render-util.so.0.0.0
7f400a9fa000-7f400a9fb000 rw-p 00003000 08:22 131048 /usr/lib64/libxcb-render-util.so.0.0.0
7f400a9fb000-7f400aa24000 r-xp 00000000 08:22 5946 /usr/lib64/libpng14.so.14.3.0
7f400aa24000-7f400ac23000 ---p 00029000 08:22 5946 /usr/lib64/libpng14.so.14.3.0
7f400ac23000-7f400ac24000 r--p 00028000 08:22 5946 /usr/lib64/libpng14.so.14.3.0
7f400ac24000-7f400ac25000 rw-p 00029000 08:22 5946 /usr/lib64/libpng14.so.14.3.0
7f400ac25000-7f400ac83000 r-xp 00000000 08:22 45583 /usr/lib64/libpixman-1.so.0.18.0
7f400ac83000-7f400ae82000 ---p 0005e000 08:22 45583 /usr/lib64/libpixman-1.so.0.18.0
7f400ae82000-7f400ae86000 r--p 0005d000 08:22 45583 /usr/lib64/libpixman-1.so.0.18.0
7f400ae86000-7f400ae87000 rw-p 00061000 08:22 45583 /usr/lib64/libpixman-1.so.0.18.0
7f400ae87000-7f400ae89000 r-xp 00000000 08:22 63108 /lib64/libdl-2.11.2.so
7f400ae89000-7f400b089000 ---p 00002000 08:22 63108 /lib64/libdl-2.11.2.so
7f400b089000-7f400b08a000 r--p 00002000 08:22 63108 /lib64/libdl-2.11.2.so
7f400b08a000-7f400b08b000 rw-p 00003000 08:22 63108 /lib64/libdl-2.11.2.so
7f400b08b000-7f400b0a7000 r-xp 00000000 08:22 205169 /usr/lib64/libxcb.so.1.1.0
7f400b0a7000-7f400b2a6000 ---p 0001c000 08:22 205169 /usr/lib64/libxcb.so.1.1.0
7f400b2a6000-7f400b2a7000 r--p 0001b000 08:22 205169 /usr/lib64/libxcb.so.1.1.0
7f400b2a7000-7f400b2a8000 rw-p 0001c000 08:22 205169 /usr/lib64/libxcb.so.1.1.0
7f400b2a8000-7f400b32c000 r-xp 00000000 08:22 32740 /usr/lib64/libfreetype.so.6.4.0
7f400b32c000-7f400b52b000 ---p 00084000 08:22 32740 /usr/lib64/libfreetype.so.6.4.0
7f400b52b000-7f400b530000 r--p 00083000 08:22 32740 /usr/lib64/libfreetype.so.6.4.0
7f400b530000-7f400b531000 rw-p 00088000 08:22 32740 /usr/lib64/libfreetype.so.6.4.0
7f400b531000-7f400b533000 r-xp 00000000 08:22 130998 /usr/lib64/libXdamage.so.1.1.0
7f400b533000-7f400b732000 ---p 00002000 08:22 130998 /usr/lib64/libXdamage.so.1.1.0
7f400b732000-7f400b733000 r--p 00001000 08:22 130998 /usr/lib64/libXdamage.so.1.1.0
7f400b733000-7f400b734000 rw-p 00002000 08:22 130998 /usr/lib64/libXdamage.so.1.1.0
7f400b734000-7f400b736000 r-xp 00000000 08:22 130994 /usr/lib64/libXcomposite.so.1.0.0
7f400b736000-7f400b935000 ---p 00002000 08:22 130994 /usr/lib64/libXcomposite.so.1.0.0
7f400b935000-7f400b936000 r--p 00001000 08:22 130994 /usr/lib64/libXcomposite.so.1.0.0
7f400b936000-7f400b937000 rw-p 00002000 08:22 130994 /usr/lib64/libXcomposite.so.1.0.0
7f400b937000-7f400b941000 r-xp 00000000 08:22 130996 /usr/lib64/libXcursor.so.1.0.2
7f400b941000-7f400bb40000 ---p 0000a000 08:22 130996 /usr/lib64/libXcursor.so.1.0.2
7f400bb40000-7f400bb41000 r--p 00009000 08:22 130996 /usr/lib64/libXcursor.so.1.0.2
7f400bb41000-7f400bb42000 rw-p 0000a000 08:22 130996 /usr/lib64/libXcursor.so.1.0.2
7f400bb42000-7f400bb4a000 r-xp 00000000 08:22 131012 /usr/lib64/libXrandr.so.2.2.0
7f400bb4a000-7f400bd49000 ---p 00008000 08:22 131012 /usr/lib64/libXrandr.so.2.2.0
7f400bd49000-7f400bd4a000 r--p 00007000 08:22 131012 /usr/lib64/libXrandr.so.2.2.0
7f400bd4a000-7f400bd4b000 rw-p 00008000 08:22 131012 /usr/lib64/libXrandr.so.2.2.0
7f400bd4b000-7f400bd5a000 r-xp 00000000 08:22 63025 /usr/lib64/libXi.so.6.1.0
7f400bd5a000-7f400bf59000 ---p 0000f000 08:22 63025 /usr/lib64/libXi.so.6.1.0
7f400bf59000-7f400bf5a000 r--p 0000e000 08:22 63025 /usr/lib64/libXi.so.6.1.0
7f400bf5a000-7f400bf5b000 rw-p 0000f000 08:22 63025 /usr/lib64/libXi.so.6.1.0
7f400bf5b000-7f400bf5d000 r-xp 00000000 08:22 131008 /usr/lib64/libXinerama.so.1.0.0
7f400bf5d000-7f400c15c000 ---p 00002000 08:22 131008 /usr/lib64/libXinerama.so.1.0.0
7f400c15c000-7f400c15d000 r--p 00001000 08:22 131008 /usr/lib64/libXinerama.so.1.0.0
7f400c15d000-7f400c15e000 rw-p 00002000 08:22 131008 /usr/lib64/libXinerama.so.1.0.0[1]

Compilation log:

gcc -fmessage-length=0 -O2 -Wall -D_FORTIFY_SOURCE=2 -fstack-protector -funwind-tables -fasynchronous-unwind-tables -g -o X2 X2.c -pthread -I/usr/include/gtk-2.0 -I/usr/lib64/gtk-2.0/include -I/usr/include/atk-1.0 -I/usr/include/cairo -I/usr/include/gdk-pixbuf-2.0 -I/usr/include/pango-1.0 -I/usr/include/glib-2.0 -I/usr/lib64/glib-2.0/include -I/usr/include/pixman-1 -I/usr/include/freetype2 -I/usr/include/libpng14 -pthread -lgtk-x11-2.0 -lgdk-x11-2.0 -latk-1.0 -lgio-2.0 -lpangoft2-1.0 -lpangocairo-1.0 -lgdk_pixbuf-2.0 -lpng14 -lm -lcairo -lpango-1.0 -lfreetype -lfontconfig -lgobject-2.0 -lgmodule-2.0 -lgthread-2.0 -lrt -lglib-2.0 -pthread -I/usr/include/gtksourceview-2.0 -I/usr/include/libxml2 -I/usr/include/gtk-2.0 -I/usr/lib64/gtk-2.0/include -I/usr/include/atk-1.0 -I/usr/include/cairo -I/usr/include/gdk-pixbuf-2.0 -I/usr/include/pango-1.0 -I/usr/include/glib-2.0 -I/usr/lib64/glib-2.0/include -I/usr/include/pixman-1 -I/usr/include/freetype2 -I/usr/include/libpng14 -pthread -lgtksourceview-2.0 -lgtk-x11-2.0 -lgdk-x11-2.0 -latk-1.0 -lgio-2.0 -lpangoft2-1.0 -lpangocairo-1.0 -lgdk_pixbuf-2.0 -lpng14 -lm -lcairo -lpango-1.0 -lfreetype -lfontconfig -lgobject-2.0 -lgmodule-2.0 -lgthread-2.0 -lrt -lglib-2.0 -pthread -I/usr/include/gtk-2.0 -I/usr/lib64/gtk-2.0/include -I/usr/include/atk-1.0 -I/usr/include/cairo -I/usr/include/gdk-pixbuf-2.0 -I/usr/include/pango-1.0 -I/usr/include/glib-2.0 -I/usr/lib64/glib-2.0/include -I/usr/include/pixman-1 -I/usr/include/freetype2 -I/usr/include/libpng14 -I/usr/include/vte-0.0 -I/usr/include/gio-unix-2.0/ -pthread -lvte -lgtk-x11-2.0 -lgdk-x11-2.0 -latk-1.0 -lpangoft2-1.0 -lpangocairo-1.0 -lgdk_pixbuf-2.0 -lpango-1.0 -lfreetype -lfontconfig -lgio-2.0 -lgobject-2.0 -lgmodule-2.0 -lgthread-2.0 -lrt -lglib-2.0 -lcairo -lX11
In file included from X2.c:16:0:
callbacks.c: In function 'drag_data_received_handler':
callbacks.c:861:16: warning: pointer targets in initialization differ in signedness
X2.c: In function 'main':
X2.c:20:7: warning: ignoring return value of 'chdir', declared with attribute warn_unused_result
In file included from X2.c:16:0:
callbacks.c: In function 'New':
callbacks.c:114:14: warning: 'ptr' may be used uninitialized in this function
Sep 24 2011
QXmlEdit 0.8.2 Text Editors
7 comments
Score 63%
63 Likes
37 Dislikes
Jun 06 2012
The correct URL is:
http://software.opensuse.org/search?q=qxmledit&baseproject=ALL&include_home=true&exclude_debug=true
Nov 07 2011
Packages for openSUSE/SLE:

http://software.opensuse.org/search?q=qxmledit
Sep 24 2010
Mediadownloader 1.5.2 Web
48 comments
Score 66%
66 Likes
34 Dislikes
Oct 28 2011
1. Mediadownloader displays not more than 63 images in "ajax api" mode.

2. Context menu "browse" doesn't open a site in "public" mode but an image. In "ajax api" mode it opens a site.
Aug 09 2011
Sintegrial Text Editor 0.4.0 Text Editors
17 comments
Score 58%
58 Likes
42 Dislikes
May 31 2010
Packages for openSUSE:
http://software.opensuse.org/search?q=%22ste%22
Nov 03 2010
HexGlass 1.2.1 Arcade
1 comment
Score 57%
57 Likes
43 Dislikes
Feb 17 2011
Packages for openSUSE:
http://software.opensuse.org/search?q=hexglass

Oct 22 2010
KCM Qt Graphics System 1.3 System Software
40 comments
Score 79%
79 Likes
21 Dislikes
Aug 26 2011
I'm running openSUSE 11.1 with Qt 4.4.3. Sep 12 2010
Not sure I want to break my system installing unsupported version of Qt.

Anyway, thanks to the Author for the job.
Sep 05 2010
I don't know a stable distro that provides Qt 4.7.0.
Sep 05 2010
Mediadownloader 1.5.2 Web
41 comments
Score 60%
60 Likes
40 Dislikes
Oct 28 2011
Thanks, alnitak!

SUSE packages updated with new name.
http://software.opensuse.org/search?q=mediadownloader
Jun 30 2010
Flacon 2.1.0 Audio Extractors/Converters
8 comments
Score 80%
80 Likes
20 Dislikes
Oct 02 2016
Now it works. Thanks.

A very good program!
Jun 04 2010
Running flacon in openSUSE 11.1.

% python -v /usr/bin/flacon
...
import PyQt4 # directory /usr/lib/python2.6/site-packages/PyQt4
import PyQt4 # from /usr/lib/python2.6/site-packages/PyQt4/__init__.py
# can't create /usr/lib/python2.6/site-packages/PyQt4/__init__.pyc
dlopen("/usr/lib/python2.6/site-packages/PyQt4/QtGui.so", 2);
dlopen("/usr/lib/python2.6/site-packages/sip.so", 2);
import sip # dynamically loaded from /usr/lib/python2.6/site-packages/sip.so
[1] 28441 segmentation fault python -v /usr/bin/flacon

python-qt4-4.4.3
python-sip-4.10.1

What is a problem?
May 28 2010
Converseen 0.9.2 Graphics
22 comments
Score 80%
80 Likes
20 Dislikes
Mar 23 2015
Packages for openSUSE:
http://software.opensuse.org/search?q=converseen Nov 21 2009
Easy RPM Builder 0.5.6 Development
18 comments
Score 71%
71 Likes
29 Dislikes
Jan 30 2010
Good idea, but your SUSE package isn't correct. Check it with rpmlint.
Oct 24 2009
ipQalc 1.4 Network
2 comments
Score 59%
59 Likes
41 Dislikes
Dec 07 2014
There is a CLI program ipcalc. I think they will conflict.

Jun 21 2009
q4wine 1.3 Linux\BSD\OSX System Software
52 comments
Score 86%
86 Likes
14 Dislikes
Feb 27 2016
Спасибо.

RPM для openSUSE 11.1 и SLE 11
http://download.opensuse.org/repositories/home:/Lazy_Kent/ May 06 2009
4.4.3
May 05 2009
У меня возникает следующая ошибка:

[ 49%] Building CXX object CMakeFiles/q4wine.dir/src/gui/run.cpp.o
/usr/bin/c++ -DQT_DLL -DQT_GUI_LIB -DQT_SQL_LIB -DQT_NETWORK_LIB -DQT_CORE_LIB -I/usr/include/QtGui -I/usr/include/QtSql -I/usr/include/QtNetwork -I/usr/include/QtCore -I/home/kent/rpmbuild/SOURCES/q4wine-0.112 -I/home/kent/rpmbuild/SOURCES/q4wine-0.112/src -I/home/kent/rpmbuild/SOURCES/q4wine-0.112/src/gui -I/home/kent/rpmbuild/SOURCES/q4wine-0.112/src/core -I/home/kent/rpmbuild/SOURCES/q4wine-0.112/src/temporary -I/home/kent/rpmbuild/SOURCES/q4wine-0.112/src/wis -Wall -g -o CMakeFiles/q4wine.dir/src/gui/run.cpp.o -c /home/kent/rpmbuild/SOURCES/q4wine-0.112/src/gui/run.cpp
/home/kent/rpmbuild/SOURCES/q4wine-0.112/src/gui/run.cpp: In member function ‘void Run::cmdGetWorkDir_Click()’:
/home/kent/rpmbuild/SOURCES/q4wine-0.112/src/gui/run.cpp:398: error: ‘class QFileDialog’ has no member named ‘setOption’
make[2]: *** [CMakeFiles/q4wine.dir/src/gui/run.cpp.o] Ошибка 1

Что можно подкрутить? May 05 2009