Member


profile-image

ViRgiLiO

Ignacio Monge Jerez de la Frontera, Spain
No supported products.
126 comments
Aeri QtCurve
Dec 19 2013
Just Cover Art KDE4 Extensions
Dec 14 2013
Just Cover Art KDE4 Extensions
Dec 14 2013
openSUSE Plasma theme Plasma Themes
Dec 01 2013
openSUSE Plasma theme Plasma Themes
Nov 30 2013
UART PLOT System Software
Nov 25 2012
light QtCurve
Mar 07 2012
Veusz Science
Aug 22 2011
QtiPlot Science
Apr 10 2008
QtiPlot Science
Sep 21 2007
kchmviewer Utilities
version: 3.1

if g++ -DHAVE_CONFIG_H -I. -I. -I../../src -I/usr/share/qt3/include -DQT_THREAD_SUPPORT -march=k8 -O2 -pipe -fomit-frame-pointer -fno-strict-aliasing -funroll-loops -D_REENTRANT -Wno-long-long -Wundef -ansi -D_XOPEN_SOURCE=500 -D_BSD_SOURCE -Wcast-align -Wconversion -Wchar-subscripts -Wall -W -Wpointer-arith -DNDEBUG -DNO_DEBUG -O2 -march=k8 -O2 -pipe -fomit-frame-pointer -fno-strict-aliasing -funroll-loops -Wformat-security -Wmissing-format-attribute -Wno-non-virtual-dtor -fno-exceptions -fno-check-new -fno-common -MT libchmfile.o -MD -MP -MF ".deps/libchmfile.Tpo" -c -o libchmfile.o libchmfile.cpp; \
then mv -f ".deps/libchmfile.Tpo" ".deps/libchmfile.Po"; else rm -f ".deps/libchmfile.Tpo"; exit 1; fi
In file included from libchmfile.cpp:23:
libchmfileimpl.h:23:21: error: chm_lib.h: No existe el fichero ó directorio
libchmfileimpl.h:100: error: ‘chmUnitInfo’ has not been declared
libchmfileimpl.h:103: error: expected ‘,’ or ‘...’ before ‘*’ token
libchmfileimpl.h:103: error: ISO C++ forbids declaration of ‘chmUnitInfo’ with no type
libchmfileimpl.h:223: error: ISO C++ forbids declaration of ‘chmFile’ with no type
libchmfileimpl.h:223: error: expected ‘;’ before ‘*’ token
libchmfileimpl.h:261: error: ‘chmUnitInfo’ does not name a type
libchmfileimpl.h:264: error: ‘chmUnitInfo’ does not name a type
libchmfileimpl.h:267: error: ‘chmUnitInfo’ does not name a type
libchmfileimpl.h:270: error: ‘chmUnitInfo’ does not name a type
libchmfileimpl.h:277: error: ‘chmUnitInfo’ does not name a type
make[2]: *** [libchmfile.o] Error 1
make[2]: se sale del directorio `/home/virgilio/temp/kchmviewer-3.1/lib/libchmfile'
make[1]: *** [all-recursive] Error 1
make[1]: se sale del directorio `/home/virgilio/temp/kchmviewer-3.1/lib'
make: *** [all-recursive] Error 1
Jun 17 2007
kchmviewer Utilities
version: 3.1

if g++ -DHAVE_CONFIG_H -I. -I. -I../../src -I/usr/share/qt3/include -DQT_THREAD_SUPPORT -march=k8 -O2 -pipe -fomit-frame-pointer -fno-strict-aliasing -funroll-loops -D_REENTRANT -Wno-long-long -Wundef -ansi -D_XOPEN_SOURCE=500 -D_BSD_SOURCE -Wcast-align -Wconversion -Wchar-subscripts -Wall -W -Wpointer-arith -DNDEBUG -DNO_DEBUG -O2 -march=k8 -O2 -pipe -fomit-frame-pointer -fno-strict-aliasing -funroll-loops -Wformat-security -Wmissing-format-attribute -Wno-non-virtual-dtor -fno-exceptions -fno-check-new -fno-common -MT libchmfile.o -MD -MP -MF ".deps/libchmfile.Tpo" -c -o libchmfile.o libchmfile.cpp; \
then mv -f ".deps/libchmfile.Tpo" ".deps/libchmfile.Po"; else rm -f ".deps/libchmfile.Tpo"; exit 1; fi
In file included from libchmfile.cpp:23:
libchmfileimpl.h:23:21: error: chm_lib.h: No existe el fichero ó directorio
libchmfileimpl.h:100: error: ‘chmUnitInfo’ has not been declared
libchmfileimpl.h:103: error: expected ‘,’ or ‘...’ before ‘*’ token
libchmfileimpl.h:103: error: ISO C++ forbids declaration of ‘chmUnitInfo’ with no type
libchmfileimpl.h:223: error: ISO C++ forbids declaration of ‘chmFile’ with no type
libchmfileimpl.h:223: error: expected ‘;’ before ‘*’ token
libchmfileimpl.h:261: error: ‘chmUnitInfo’ does not name a type
libchmfileimpl.h:264: error: ‘chmUnitInfo’ does not name a type
libchmfileimpl.h:267: error: ‘chmUnitInfo’ does not name a type
libchmfileimpl.h:270: error: ‘chmUnitInfo’ does not name a type
libchmfileimpl.h:277: error: ‘chmUnitInfo’ does not name a type
make[2]: *** [libchmfile.o] Error 1
make[2]: se sale del directorio `/home/virgilio/temp/kchmviewer-3.1/lib/libchmfile'
make[1]: *** [all-recursive] Error 1
make[1]: se sale del directorio `/home/virgilio/temp/kchmviewer-3.1/lib'
make: *** [all-recursive] Error 1
Jun 17 2007
kchmviewer Utilities
version: 3.1

if g++ -DHAVE_CONFIG_H -I. -I. -I../../src -I/usr/share/qt3/include -DQT_THREAD_SUPPORT -march=k8 -O2 -pipe -fomit-frame-pointer -fno-strict-aliasing -funroll-loops -D_REENTRANT -Wno-long-long -Wundef -ansi -D_XOPEN_SOURCE=500 -D_BSD_SOURCE -Wcast-align -Wconversion -Wchar-subscripts -Wall -W -Wpointer-arith -DNDEBUG -DNO_DEBUG -O2 -march=k8 -O2 -pipe -fomit-frame-pointer -fno-strict-aliasing -funroll-loops -Wformat-security -Wmissing-format-attribute -Wno-non-virtual-dtor -fno-exceptions -fno-check-new -fno-common -MT libchmfile.o -MD -MP -MF ".deps/libchmfile.Tpo" -c -o libchmfile.o libchmfile.cpp; \
then mv -f ".deps/libchmfile.Tpo" ".deps/libchmfile.Po"; else rm -f ".deps/libchmfile.Tpo"; exit 1; fi
In file included from libchmfile.cpp:23:
libchmfileimpl.h:23:21: error: chm_lib.h: No existe el fichero ó directorio
libchmfileimpl.h:100: error: ‘chmUnitInfo’ has not been declared
libchmfileimpl.h:103: error: expected ‘,’ or ‘...’ before ‘*’ token
libchmfileimpl.h:103: error: ISO C++ forbids declaration of ‘chmUnitInfo’ with no type
libchmfileimpl.h:223: error: ISO C++ forbids declaration of ‘chmFile’ with no type
libchmfileimpl.h:223: error: expected ‘;’ before ‘*’ token
libchmfileimpl.h:261: error: ‘chmUnitInfo’ does not name a type
libchmfileimpl.h:264: error: ‘chmUnitInfo’ does not name a type
libchmfileimpl.h:267: error: ‘chmUnitInfo’ does not name a type
libchmfileimpl.h:270: error: ‘chmUnitInfo’ does not name a type
libchmfileimpl.h:277: error: ‘chmUnitInfo’ does not name a type
make[2]: *** [libchmfile.o] Error 1
make[2]: se sale del directorio `/home/virgilio/temp/kchmviewer-3.1/lib/libchmfile'
make[1]: *** [all-recursive] Error 1
make[1]: se sale del directorio `/home/virgilio/temp/kchmviewer-3.1/lib'
make: *** [all-recursive] Error 1
Jun 17 2007
BasKet Note Pads Utilities
May 27 2007
Tasty Menu Various KDE Extensions
May 07 2007