Member


profile-image

gratchie

grace thompson
No supported products.
2 comments
wacom tablet System Software
[ 20%] Building CXX object src/applet/CMakeFiles/plasma_applet_wacomtabletsettings.dir/tabletapplet.o
/localhome/gracie/wacomtablet-2.0.2/src/applet/tabletapplet.cpp:41:28: error: Plasma/Separator: No such file or directory
/localhome/gracie/wacomtablet-2.0.2/src/applet/tabletapplet.cpp: In member function ‘void Wacom::TabletApplet::buildDialog()’:
/localhome/gracie/wacomtablet-2.0.2/src/applet/tabletapplet.cpp:318: error: ‘KIcon’ was not declared in this scope
/localhome/gracie/wacomtablet-2.0.2/src/applet/tabletapplet.cpp:334: error: ‘Separator’ is not a member of ‘Plasma’
/localhome/gracie/wacomtablet-2.0.2/src/applet/tabletapplet.cpp:334: error: ‘separator’ was not declared in this scope
/localhome/gracie/wacomtablet-2.0.2/src/applet/tabletapplet.cpp:334: error: expected type-specifier
/localhome/gracie/wacomtablet-2.0.2/src/applet/tabletapplet.cpp:334: error: expected ‘;’
/localhome/gracie/wacomtablet-2.0.2/src/applet/tabletapplet.cpp: In member function ‘void Wacom::TabletApplet::buildConfigDialog()’:
/localhome/gracie/wacomtablet-2.0.2/src/applet/tabletapplet.cpp:434: error: ‘KIcon’ was not declared in this scope
/localhome/gracie/wacomtablet-2.0.2/src/applet/tabletapplet.cpp: In member function ‘void Wacom::TabletApplet::buildErrorDialog()’:
/localhome/gracie/wacomtablet-2.0.2/src/applet/tabletapplet.cpp:514: error: ‘KIcon’ was not declared in this scope
make[2]: *** [src/applet/CMakeFiles/plasma_applet_wacomtabletsettings.dir/tabletapplet.o] Error 1
make[1]: *** [src/applet/CMakeFiles/plasma_applet_wacomtabletsettings.dir/all] Error 2
Jul 14 2014
wacom tablet System Software
Jun 10 2014