profile-image

elusive

Jan Hofmann Hannover, Germany

Simple Ubuntu GDM

GDM Themes Dec 28 2008
Score 72%
72.00 Likes
28 Dislikes

smoothyan

Kbfx Startmenu May 11 2007
Score 82%
82.00 Likes
18 Dislikes
Choqok Web
Mar 28 2010
Lucid Purple Wallpaper Other
Mar 07 2010
Lucid Purple Wallpaper Other
Mar 07 2010
Oxygen-Molecule KDE & GTK+ unified theme QtCurve
Feb 11 2010
DarkMiu GTK2 Themes
Feb 27 2009
Murrina Quiet GDM GDM Themes
Jan 21 2009
Kopete Reloading Kit Various KDE Extensions
Hi,

I get this error message while compiling:

perhabs someone can build a .deb?

Error:
/usr/include/linux/videodev2.h:744: error: '__s64' does not name a type
videodevice.cpp: In member function 'int Kopete::AV::VideoDevice::selectInput(int)':
videodevice.cpp:752: warning: comparison between signed and unsigned integer expressions
videodevice.cpp: In member function 'int Kopete::AV::VideoDevice::setInputParameters()':
videodevice.cpp:798: warning: comparison between signed and unsigned integer expressions
videodevice.cpp: In member function 'float Kopete::AV::VideoDevice::getBrightness()':
videodevice.cpp:1294: warning: comparison between signed and unsigned integer expressions
videodevice.cpp: In member function 'float Kopete::AV::VideoDevice::setBrightness(float)':
videodevice.cpp:1317: warning: converting to '__u16' from 'float'
videodevice.cpp: In member function 'float Kopete::AV::VideoDevice::getContrast()':
videodevice.cpp:1332: warning: comparison between signed and unsigned integer expressions
videodevice.cpp: In member function 'float Kopete::AV::VideoDevice::setContrast(float)':
videodevice.cpp:1355: warning: converting to '__u16' from 'float'
videodevice.cpp: In member function 'float Kopete::AV::VideoDevice::getSaturation()':
videodevice.cpp:1370: warning: comparison between signed and unsigned integer expressions
videodevice.cpp: In member function 'float Kopete::AV::VideoDevice::setSaturation(float)':
videodevice.cpp:1393: warning: converting to '__u16' from 'float'
videodevice.cpp: In member function 'float Kopete::AV::VideoDevice::getWhiteness()':
videodevice.cpp:1408: warning: comparison between signed and unsigned integer expressions
videodevice.cpp: In member function 'float Kopete::AV::VideoDevice::setWhiteness(float)':
videodevice.cpp:1431: warning: converting to '__u16' from 'float'
videodevice.cpp: In member function 'float Kopete::AV::VideoDevice::getHue()':
videodevice.cpp:1446: warning: comparison between signed and unsigned integer expressions
videodevice.cpp: In member function 'float Kopete::AV::VideoDevice::setHue(float)':
videodevice.cpp:1469: warning: converting to '__u16' from 'float'
videodevice.cpp: In member function 'bool Kopete::AV::VideoDevice::getAutoBrightnessContrast()':
videodevice.cpp:1485: warning: comparison between signed and unsigned integer expressions
videodevice.cpp: In member function 'bool Kopete::AV::VideoDevice::setAutoBrightnessContrast(bool)':
videodevice.cpp:1494: warning: comparison between signed and unsigned integer expressions
videodevice.cpp: In member function 'bool Kopete::AV::VideoDevice::getAutoColorCorrection()':
videodevice.cpp:1506: warning: comparison between signed and unsigned integer expressions
videodevice.cpp: In member function 'bool Kopete::AV::VideoDevice::setAutoColorCorrection(bool)':
videodevice.cpp:1515: warning: comparison between signed and unsigned integer expressions
videodevice.cpp: In member function 'bool Kopete::AV::VideoDevice::getImageAsMirror()':
videodevice.cpp:1526: warning: comparison between signed and unsigned integer expressions
videodevice.cpp: In member function 'bool Kopete::AV::VideoDevice::setImageAsMirror(bool)':
videodevice.cpp:1535: warning: comparison between signed and unsigned integer expressions
make[4]: *** [videodevice.lo] Fehler 1
make[4]: Leaving directory `/home/jan/kopete-0.12.2/kopete/libkopete/avdevice'
make[3]: *** [all-recursive] Fehler 1
make[3]: Leaving directory `/home/jan/kopete-0.12.2/kopete/libkopete'
make[2]: *** [all-recursive] Fehler 1
make[2]: Leaving directory `/home/jan/kopete-0.12.2/kopete'
make[1]: *** [all-recursive] Fehler 1
make[1]: Leaving directory `/home/jan/kopete-0.12.2'
make: *** [all] Fehler 2
May 23 2007