Image 01
profile-image

Chytrex_double

Chytrex Petule Bohumin, Czech Republic
World of Padman KDM

KDM3 Themes by Padster 10 comments

Do you think that post link to wote "GOOD" is really kind? Do you think that this is correct? I think this is cheating.. Shame on you! - Mar 12 2010
zNotes

Notes by ru-proton 52 comments

Thanks for answer. So I don't try compile this anymore. You use some features from QT4.5 - Oct 10 2009
zNotes

Notes by ru-proton 52 comments

Now i have bit different error:
Quote:
/usr/bin/lrelease translations/znotes_ru.ts
/usr/bin/uic-qt4 mainwindow.ui -o build/ui_mainwindow.h
/usr/bin/uic-qt4 configdialog.ui -o build/ui_configdialog.h
g++ -c -pipe -O2 -Wall -W -D_REENTRANT -DPROGRAM_DATA_DIR=\"/usr/share/znotes/\" -DVERSION=\"0.2.6\" -DQT_NO_DEBUG -DQT_GUI_LIB -DQT_CORE_LIB -DQT_SHARED -I/usr/share/qt4/mkspecs/linux-g++ -I. -I/usr/include/qt4/QtCore -I/usr/include/qt4/QtCore -I/usr/include/qt4/QtGui -I/usr/include/qt4/QtGui -I/usr/include/qt4 -Ibuild -Ibuild -o build/main.o main.cpp
g++ -c -pipe -O2 -Wall -W -D_REENTRANT -DPROGRAM_DATA_DIR=\"/usr/share/znotes/\" -DVERSION=\"0.2.6\" -DQT_NO_DEBUG -DQT_GUI_LIB -DQT_CORE_LIB -DQT_SHARED -I/usr/share/qt4/mkspecs/linux-g++ -I. -I/usr/include/qt4/QtCore -I/usr/include/qt4/QtCore -I/usr/include/qt4/QtGui -I/usr/include/qt4/QtGui -I/usr/include/qt4 -Ibuild -Ibuild -o build/mainwindow.o mainwindow.cpp
In file included from mainwindow.cpp:2:
build/ui_mainwindow.h: In member function ‘void Ui_MainWindow::setupUi(QMainWindow*)’:
build/ui_mainwindow.h:56: error: ‘class QTabWidget’ has no member named ‘setDocumentMode’
make: *** [build/mainwindow.o] Error 1


What is minimal version of QT4 for this app? - Oct 09 2009
zNotes

Notes by ru-proton 52 comments

Quote:
/usr/bin/uic-qt4 mainwindow.ui -o ui_mainwindow.h
/usr/bin/uic-qt4 configdialog.ui -o ui_configdialog.h
g++ -c -pipe -O2 -Wall -W -D_REENTRANT -DQT_NO_DEBUG -DQT_GUI_LIB -DQT_CORE_LIB -DQT_SHARED -I/usr/share/qt4/mkspecs/linux-g++ -I. -I/usr/include/qt4/QtCore -I/usr/include/qt4/QtCore -I/usr/include/qt4/QtGui -I/usr/include/qt4/QtGui -I/usr/include/qt4 -I. -I. -o main.o main.cpp
g++ -c -pipe -O2 -Wall -W -D_REENTRANT -DQT_NO_DEBUG -DQT_GUI_LIB -DQT_CORE_LIB -DQT_SHARED -I/usr/share/qt4/mkspecs/linux-g++ -I. -I/usr/include/qt4/QtCore -I/usr/include/qt4/QtCore -I/usr/include/qt4/QtGui -I/usr/include/qt4/QtGui -I/usr/include/qt4 -I. -I. -o mainwindow.o mainwindow.cpp
mainwindow.cpp: In constructor ‘MainWindow::MainWindow(QWidget*)’:
mainwindow.cpp:208: error: invalid use of incomplete type ‘struct QStyle’
/usr/include/qt4/QtGui/qwidget.h:66: error: forward declaration of ‘struct QStyle’
mainwindow.cpp:208: error: incomplete type ‘QStyle’ used in nested name specifier
mainwindow.cpp:209: error: invalid use of incomplete type ‘struct QStyle’
/usr/include/qt4/QtGui/qwidget.h:66: error: forward declaration of ‘struct QStyle’
mainwindow.cpp:209: error: incomplete type ‘QStyle’ used in nested name specifier
mainwindow.cpp:210: error: invalid use of incomplete type ‘struct QStyle’
/usr/include/qt4/QtGui/qwidget.h:66: error: forward declaration of ‘struct QStyle’
mainwindow.cpp:210: error: incomplete type ‘QStyle’ used in nested name specifier
mainwindow.cpp:223: error: invalid use of incomplete type ‘struct QStyle’
/usr/include/qt4/QtGui/qwidget.h:66: error: forward declaration of ‘struct QStyle’
mainwindow.cpp:223: error: incomplete type ‘QStyle’ used in nested name specifier
mainwindow.cpp:230: error: invalid use of incomplete type ‘struct QStyle’
/usr/include/qt4/QtGui/qwidget.h:66: error: forward declaration of ‘struct QStyle’
mainwindow.cpp:230: error: incomplete type ‘QStyle’ used in nested name specifier
make: *** [mainwindow.o] Error 1


Using Qt version 4.4.3 in /usr/lib

qt4 development packages are installed.. Any ideas?
- Oct 05 2009
QEVEN

Video Apps by wyxknouth 14 comments

If you provide english version, I try translate it to czech. - Sep 25 2009
KSmoothDock

Various Plasma 5 Improvements by dangvd 703 comments

Under debian lenny compilation gives this error:
Quote:In file included from /usr/share/qt3/include/qwindowdefs.h:47,
from /usr/share/qt3/include/qwidget.h:45,
from ksmoothdock.h:31,
from main.cpp:22:
/usr/share/qt3/include/qstring.h: In member function ‘char QChar::latin1() const’:
/usr/share/qt3/include/qstring.h:197: warning: conversion to ‘char’ from ‘int’ may alter its value
/usr/share/qt3/include/qstring.h: In member function ‘void QChar::setCell(uchar)’:
/usr/share/qt3/include/qstring.h:222: warning: conversion to ‘ushort’ from ‘int’ may alter its value
/usr/share/qt3/include/qstring.h: In member function ‘void QChar::setRow(uchar)’:
/usr/share/qt3/include/qstring.h:223: warning: conversion to ‘ushort’ from ‘int’ may alter its value
/usr/share/qt3/include/qstring.h: In constructor ‘QChar::QChar(uchar, uchar)’:
/usr/share/qt3/include/qstring.h:267: warning: conversion to ‘ushort’ from ‘int’ may alter its value
/usr/share/qt3/include/qstring.h: In constructor ‘QStringData::QStringData(QChar*, uint, uint)’:
/usr/share/qt3/include/qstring.h:365: warning: conversion to ‘unsigned int:30’ from ‘uint’ may alter its value
/usr/share/qt3/include/qstring.h:365: warning: conversion to ‘unsigned int:30’ from ‘uint’ may alter its value
In file included from /usr/share/qt3/include/qobject.h:48,
from /usr/share/qt3/include/qwidget.h:46,
from ksmoothdock.h:31,
from main.cpp:22:
/usr/share/qt3/include/qevent.h: In member function ‘void QDropEvent::setAction(QDropEvent::Action)’:
/usr/share/qt3/include/qevent.h:523: warning: conversion to ‘unsigned char’ from ‘uint’ may alter its value
In file included from /usr/share/qt3/include/qwidget.h:52,
from ksmoothdock.h:31,
from main.cpp:22:
/usr/share/qt3/include/qsizepolicy.h: In member function ‘void QSizePolicy::transpose()’:
/usr/share/qt3/include/qsizepolicy.h:125: warning: conversion to ‘uchar’ from ‘uint’ may alter its value
/usr/share/qt3/include/qsizepolicy.h:125: warning: conversion to ‘uchar’ from ‘uint’ may alter its value
In file included from main.cpp:22:
ksmoothdock.h: At global scope:
ksmoothdock.h:313: error: ISO C++ forbids declaration of ‘auto_ptr’ with no type
ksmoothdock.h:313: error: invalid use of ‘::’
ksmoothdock.h:313: error: expected ‘;’ before ‘<’ token
ksmoothdock.h:314: error: ISO C++ forbids declaration of ‘auto_ptr’ with no type
ksmoothdock.h:314: error: invalid use of ‘::’
ksmoothdock.h:314: error: expected ‘;’ before ‘<’ token
ksmoothdock.h:315: error: ISO C++ forbids declaration of ‘auto_ptr’ with no type
ksmoothdock.h:315: error: invalid use of ‘::’
ksmoothdock.h:315: error: expected ‘;’ before ‘<’ token
ksmoothdock.h:318: error: ISO C++ forbids declaration of ‘auto_ptr’ with no type
ksmoothdock.h:318: error: invalid use of ‘::’
ksmoothdock.h:318: error: expected ‘;’ before ‘<’ token
In file included from /usr/include/kde/kaboutdata.h:24,
from main.cpp:24:
/usr/share/qt3/include/qimage.h: In member function ‘bool QImageTextKeyLang::operator<(const QImageTextKeyLang&) const’:
/usr/share/qt3/include/qimage.h:61: warning: suggest parentheses around && within ||
make[2]: *** [main.o] Error 1
make[2]: Leaving directory `/home/chytrex/TEMP/ksmoothdock/src'
make[1]: *** [all-recursive] Error 1
make[1]: Leaving directory `/home/chytrex/TEMP/ksmoothdock'
make: *** [all] Error 2

Any ideas how to solve this? - Feb 13 2009
Kopete Antispam Plugin

Chat & Messenging by alno 47 comments

Grat job, man. I have one feature request. It's possible to add list of contacts wich I don't want to bother with this antispam? - Jun 10 2008
Kima - kicker monitoring applet

Various KDE 1.-4. Improvements by kenws 360 comments

I am missed on kima custom text fields. It would be great if I can modify output of kima with my own texts.. - Aug 22 2007
has anyone package of qtcurve for QT4 for my kubuntu 6.06? - Aug 13 2007
KIO Slave sysinfo:/

Various KDE 1.-4. Improvements by jerrad 241 comments

On Kubuntu 6.06 Dapper drake (i386) make crashes with this error:


/usr/lib/libhd.a(hd.o): In function `str_printf': undefined reference to `__stack_chk_fail_local'
/usr/lib/libhd.a(hd.o): In function `progress': undefined reference to `__stack_chk_fail_local'
/usr/lib/libhd.a(hd.o): In function `read_file': undefined reference to `__stack_chk_fail_local'
/usr/lib/libhd.a(hd.o): In function `read_udevinfo': undefined reference to `__stack_chk_fail_local'
/usr/lib/libhd.a(hd.o): In function `.L1690': undefined reference to `__stack_chk_fail_local'
/usr/lib/libhd.a(hd.o): more undefined references to `__stack_chk_fail_local' follow
collect2: ld returned 1 exit status
make[2]: *** [kio_sysinfo.la] Error 1
make[2]: Leaving directory `/home/chytrex/TEMP/kio-sysinfo-1.7.1/src'
make[1]: *** [all-recursive] Error 1
make[1]: Leaving directory `/home/chytrex/TEMP/kio-sysinfo-1.7.1'
make: *** [all] Error 2


Any ideas how I can fix this error? - Jul 09 2007
QFlv2Avi

Video Apps by manudwarf 19 comments

My QT version is 4.1.2. Above is written required version 4.x so this shoudn't be problem. - Apr 30 2007
QFlv2Avi

Video Apps by manudwarf 19 comments

I try compile it on Kubuntu 6.06 Dapper and this error appear:
mainwindow.cpp: In member function ‘void MainWindow::encodeError()’:
mainwindow.cpp:43: error: no matching function for call to ‘QMessageBox::critical(MainWindow* const, const char [18], const char [40], QMessageBox::Button)’
/usr/include/qt4/QtGui/qmessagebox.h:114: note: candidates are: static int QMessageBox::critical(QWidget*, const QString&, const QString&, int, int, int)
/usr/include/qt4/QtGui/qmessagebox.h:121: note: static int QMessageBox::critical(QWidget*, const QString&, const QString&, const QString&, const QString&, const QString&, int, int)
make: *** [mainwindow.o] Error 1

Any ideas?
Thanks in advance - Apr 28 2007
KSquirrel

Graphic Apps by CKulT 185 comments

Thanks for your advice, I reinstalled libgamin-dev and compiling has successful. Thanks a lot.:)
Ksquirrel is great. Thanks - Apr 02 2007
KSquirrel

Graphic Apps by CKulT 185 comments

Hi. I Tried compile Ksquirrel on Kubuntu 6.06 Dapper. Compiling libs is without probllem, but when I try compile main program this fail on package libfam0. This package is conflicting with libgamin0. I found on google ( https://bugs.launchpad.net/ubuntu/+source/fam/+bug/5144 ) some texts about compatibility libfam and libgamin. Any ideas? What should I do? - Apr 02 2007
kooldock

Various KDE 1.-4. Improvements by bisiek 227 comments

Hi. When I try make package for my Kubuntu 6.06 Dapper with sudo checkinstall I get these error:
Quote:
WARNING: use unsermake instead of make or use a wrapper script, e.g. makeobj!!!
unsermake install
Traceback (most recent call last):
File "<string>", line 1, in ?
File "/usr/lib/python2.4/site-packages/unsermake/__init__.py", line 1342, in ?
main()
File "/usr/lib/python2.4/site-packages/unsermake/__init__.py", line 1028, in main
files = os.listdir(sourcedir)
OSError: [Errno 2] No such file or directory: '/usr/lib/python2.4/site-packages/unsermake'
make: *** [install] Error 1

**** Installation failed. Aborting package creation.

Cleaning up...OK

Bye.

Any ideas how I can fix this?

PS: With sudo make install I can install kooldock, but I want package. - Mar 29 2007
qutIM

Chat & Messenging
by EuroElessar

6 .4
Sep 28 2010
Kid3

MP3 Taggers
by ufleisch

8 .7
May 06 2009
Join the Revolution

Wallpaper Other
by stanko

6 .3
Apr 18 2009
8 .3
Feb 16 2009
Yakuake

System Software
by Sho

8 .7
Feb 16 2009