Image 01
profile-image

Geoffinoz

Geoffrey Porter
test
RSS Guard

Qt Tools 7 comments

Score 58.0%
Jan 02 2015
previous version rssguard-2.0.0.0 compiles ok, rssguard-2.0.0.2 errors

[ 39%] Building CXX object CMakeFiles/rssguard.dir/src/gui/formmain.cpp.o
In file included from /initrd/mnt/dev_save/Downloads/rssguard-2.0.0.2/src/miscellaneous/iconfactory.h:24,
from /initrd/mnt/dev_save/Downloads/rssguard-2.0.0.2/src/gui/tabbar.h:21,
from /initrd/mnt/dev_save/Downloads/rssguard-2.0.0.2/src/gui/tabwidget.h:21,
from /initrd/mnt/dev_save/Downloads/rssguard-2.0.0.2/build/ui_formmain.h:23,
from /initrd/mnt/dev_save/Downloads/rssguard-2.0.0.2/src/gui/formmain.h:21,
from /initrd/mnt/dev_save/Downloads/rssguard-2.0.0.2/src/gui/formmain.cpp:18:
/initrd/mnt/dev_save/Downloads/rssguard-2.0.0.2/src/miscellaneous/application.h:1: error: stray '\357' in program
/initrd/mnt/dev_save/Downloads/rssguard-2.0.0.2/src/miscellaneous/application.h:1: error: stray '\273' in program
/initrd/mnt/dev_save/Downloads/rssguard-2.0.0.2/src/miscellaneous/application.h:1: error: stray '\277' in program
In file included from /initrd/mnt/dev_save/Downloads/rssguard-2.0.0.2/src/gui/formmain.cpp:22:
/initrd/mnt/dev_save/Downloads/rssguard-2.0.0.2/src/miscellaneous/application.h:1: error: stray '\357' in program
/initrd/mnt/dev_save/Downloads/rssguard-2.0.0.2/src/miscellaneous/application.h:1: error: stray '\273' in program
/initrd/mnt/dev_save/Downloads/rssguard-2.0.0.2/src/miscellaneous/application.h:1: error: stray '\277' in program
make[2]: *** [CMakeFiles/rssguard.dir/src/gui/formmain.cpp.o] Error 1
make[1]: *** [CMakeFiles/rssguard.dir/all] Error 2
make: *** [all] Error 2
#
- Sep 29 2014
HotShots

Graphic Apps 23 comments

by xbee
Score 81.6%
Jul 19 2014
Just a note to let you know that the last three builds I've done, the hotshots.desktop is in /usr/share/application, that should be applications, it's only that I install over the top of old builds why I didn't notice. - Feb 16 2014
Disregard my post, I found the problem, it was a broken symlink in X11 - Feb 16 2014
I receive this error building version 2.1.0

/usr/X11R6/lib/libX11.a(ConnDis.o): In function `_X11TransConnectDisplay':
ConnDis.c:(.text+0xc60): undefined reference to `XdmcpWrap'
collect2: ld returned 1 exit status
make[1]: *** [release/hotshots] Error 1

nothing has changed on my system since compiling the previous version 2.0.1

- Feb 16 2014
Metronome

Audio Apps 1 comment

Score 50.0%
Aug 26 2007
I know this old but metronome fails after a period of a minute or two.


Quote:
# metronome
ALSA lib pcm_misc.c:740:(snd_pcm_parse_control_id) Cannot get index for 0
cannot open audio device default (Too many open files)

- Oct 09 2013