Image 01
profile-image

gohanz

andrea sciucca
Wallpapers Gnome
LeechCraft

Browser 22 comments

Score 75.8%
Apr 03 2014
The only app i know using Qscintilla is Eric4 and work without problems. - Dec 04 2011
On Slackware the file ld.so.conf missing the /usr/lib/qt/lib path.
But i have all the qt4 libraries inside this directory and i have this problem only with the POPISHU plugin and the shared Qscintilla libraries.
Leechcraft run without problems... - Dec 02 2011
This is another error. Leechcraft build without problem the POPISHU plugin. But when i start leechcraft i have this error
/usr/lib/leechcraft/plugins/libleechcraft_popishu.so: libqscintilla2.so.5 => not found
I have Qscintilla2 installed and the requested library is inside /usr/lib/qt/lib

# ls -l *qscintill*
lrwxrwxrwx 1 root root 23 apr 28 2011 libqscintilla2.so -> libqscintilla2.so.5.4.1*
lrwxrwxrwx 1 root root 23 apr 28 2011 libqscintilla2.so.5 -> libqscintilla2.so.5.4.1*
lrwxrwxrwx 1 root root 23 apr 28 2011 libqscintilla2.so.5.4 -> libqscintilla2.so.5.4.1*
-rwxr-xr-x 1 root root 1713596 mar 25 2011 libqscintilla2.so.5.4.1*




- Dec 01 2011
Many thanks now leechcraft start without problems. - Dec 01 2011
bt
#0 0xb6d8b2d7 in raise () from /lib/libc.so.6
#1 0xb6d8ccee in abort () from /lib/libc.so.6
#2 0xb71536c2 in qt_message_output(QtMsgType, char const*) () from /usr/lib/libQtCore.so.4
#3 0xb7153867 in ?? () from /usr/lib/libQtCore.so.4
#4 0xb7153979 in qFatal(char const*, ...) () from /usr/lib/libQtCore.so.4
#5 0xb7153a05 in qt_assert(char const*, char const*, int) () from /usr/lib/libQtCore.so.4
#6 0xade47021 in ?? () from /usr/lib/qt/plugins/crypto/libqca-gnupg.so
#7 0xade4708b in ?? () from /usr/lib/qt/plugins/crypto/libqca-gnupg.so
#8 0xade4c876 in gpgQCAPlugin::MyKeyStoreList::gpg_finished() () from /usr/lib/qt/plugins/crypto/libqca-gnupg.so
#9 0xade47695 in gpgQCAPlugin::MyKeyStoreList::qt_metacall(QMetaObject::Call, int, void**) ()
from /usr/lib/qt/plugins/crypto/libqca-gnupg.so
#10 0xb7257b7a in QMetaObject::metacall(QObject*, QMetaObject::Call, int, void**) () from /usr/lib/libQtCore.so.4
#11 0xb72679bd in QMetaObject::activate(QObject*, QMetaObject const*, int, void**) () from /usr/lib/libQtCore.so.4
#12 0xade51f69 in gpgQCAPlugin::GpgOp::finished() () from /usr/lib/qt/plugins/crypto/libqca-gnupg.so
#13 0xade41fbe in gpgQCAPlugin::GpgOp::Private::act_finished() () from /usr/lib/qt/plugins/crypto/libqca-gnupg.so
#14 0xade3bc7c in gpgQCAPlugin::GpgOp::Private::qt_metacall(QMetaObject::Call, int, void**) ()
from /usr/lib/qt/plugins/crypto/libqca-gnupg.so
#15 0xb7257b7a in QMetaObject::metacall(QObject*, QMetaObject::Call, int, void**) () from /usr/lib/libQtCore.so.4
#16 0xb72679bd in QMetaObject::activate(QObject*, QMetaObject const*, int, void**) () from /usr/lib/libQtCore.so.4
#17 0xade38c09 in gpgQCAPlugin::GpgAction::finished() () from /usr/lib/qt/plugins/crypto/libqca-gnupg.so
#18 0xade3f23e in gpgQCAPlugin::GpgAction::processResult(int) () from /usr/lib/qt/plugins/crypto/libqca-gnupg.so
#19 0xade3b72a in gpgQCAPlugin::GpgAction::qt_metacall(QMetaObject::Call, int, void**) () from /usr/lib/qt/plugins/crypto/libqca-gnupg.so
#20 0xb7257b7a in QMetaObject::metacall(QObject*, QMetaObject::Call, int, void**) () from /usr/lib/libQtCore.so.4
#21 0xb72679bd in QMetaObject::activate(QObject*, QMetaObject const*, int, void**) () from /usr/lib/libQtCore.so.4
#22 0xade51b95 in gpgQCAPlugin::GPGProc::finished(int) () from /usr/lib/qt/plugins/crypto/libqca-gnupg.so
#23 0xade33f3b in gpgQCAPlugin::GPGProc::Private::qt_metacall(QMetaObject::Call, int, void**) ()
from /usr/lib/qt/plugins/crypto/libqca-gnupg.so
#24 0xb7257b7a in QMetaObject::metacall(QObject*, QMetaObject::Call, int, void**) () from /usr/lib/libQtCore.so.4
#25 0xb72679bd in QMetaObject::activate(QObject*, QMetaObject const*, int, void**) () from /usr/lib/libQtCore.so.4
#26 0xade335a5 in gpgQCAPlugin::QProcessSignalRelay::finished(int) () from /usr/lib/qt/plugins/crypto/libqca-gnupg.so
#27 0xade3375a in gpgQCAPlugin::QProcessSignalRelay::qt_metacall(QMetaObject::Call, int, void**) ()
from /usr/lib/qt/plugins/crypto/libqca-gnupg.so
#28 0xb7257b7a in QMetaObject::metacall(QObject*, QMetaObject::Call, int, void**) () from /usr/lib/libQtCore.so.4
#29 0xb72622c6 in QMetaCallEvent::placeMetaCall(QObject*) () from /usr/lib/libQtCore.so.4
#30 0xb726684f in QObject::event(QEvent*) () from /usr/lib/libQtCore.so.4
#31 0xb76378c4 in QApplicationPrivate::notify_helper(QObject*, QEvent*) () from /usr/lib/libQtGui.so.4
#32 0xb763c40e in QApplication::notify(QObject*, QEvent*) () from /usr/lib/libQtGui.so.4
#33 0x08096eee in ?? ()
#34 0xb725152b in QCoreApplication::notifyInternal(QObject*, QEvent*) () from /usr/lib/libQtCore.so.4
#35 0xb7255145 in QCoreApplicationPrivate::sendPostedEvents(QObject*, int, QThreadData*) () from /usr/lib/libQtCore.so.4
#36 0xb725531d in QCoreApplication::sendPostedEvents(QObject*, int) () from /usr/lib/libQtCore.so.4
#37 0xb727ea34 in ?? () from /usr/lib/libQtCore.so.4
#38 0xb6c79432 in g_main_context_dispatch () from /usr/lib/libglib-2.0.so.0
---Type <return> to continue, or q <return> to quit---
#39 0xb6c79c10 in ?? () from /usr/lib/libglib-2.0.so.0
#40 0xb6c79ec4 in g_main_context_iteration () from /usr/lib/libglib-2.0.so.0
#41 0xb727ebac in QEventDispatcherGlib::processEvents(QFlags<QEventLoop::ProcessEventsFlag>) () from /usr/lib/libQtCore.so.4
#42 0xb72506e9 in QEventLoop::processEvents(QFlags<QEventLoop::ProcessEventsFlag>) () from /usr/lib/libQtCore.so.4
#43 0xb725098a in QEventLoop::exec(QFlags<QEventLoop::ProcessEventsFlag>) () from /usr/lib/libQtCore.so.4
#44 0xafd48069 in QCA::SyncThread::run() () from /usr/lib/libqca.so.2
#45 0xb715bd09 in ?? () from /usr/lib/libQtCore.so.4
#46 0xb6d4bc04 in start_thread () from /lib/libpthread.so.0
#47 0xb6e3b02e in clone () from /lib/libc.so.6
(gdb)
(gdb)
- Dec 01 2011
Same runtime error with -DENABLE_MEDIACALLS=FALSE

> leechcraft
QTranslator* LeechCraft::Util::InstallTranslator(const QString&, const QString&, const QString&) could not load translation file for locale "it_IT" "qt_it_IT"
Annullato - Dec 01 2011
Leechcraft crash on startup with my Slackware 13.37 and Italian localization. It start without problems only when i disable the azoth plugin during compilation -DENABLE_AZOTH=FALSE.
This is the console output on error

> leechcraft
QTranslator* LeechCraft::Util::InstallTranslator(const QString&, const QString&, const QString&) could not load translation file for locale "it_IT" "qt_it_IT" - Nov 30 2011
Tupi: 2D Magic

Graphic Apps 5 comments

Score 58.0%
Jun 16 2013
Tupi crash when i try to create a new animation.
This is the backtrace. I'm on Slackware 13.37.

[Thread debugging using libthread_db enabled]
[New Thread 0xb1fa3b70 (LWP 18877)]
0xb57543d1 in waitpid () from /lib/libpthread.so.0
#0 0xb57543d1 in waitpid () from /lib/libpthread.so.0
#1 0x0808308e in ?? ()
#2
#3 0xb5de3942 in QAction::activate(QAction::ActionEvent) () from /usr/lib/qt/lib/libQtGui.so.4
#4 0x080aaed2 in ?? ()
#5 0x080b0777 in ?? ()
#6 0xb5a48b7a in QMetaObject::metacall(QObject*, QMetaObject::Call, int, void**) () from /usr/lib/qt/lib/libQtCore.so.4
#7 0xb5a589bd in QMetaObject::activate(QObject*, QMetaObject const*, int, void**) () from /usr/lib/qt/lib/libQtCore.so.4
#8 0xb5a5ea57 in ?? () from /usr/lib/qt/lib/libQtCore.so.4
#9 0xb5a5eb0c in ?? () from /usr/lib/qt/lib/libQtCore.so.4
#10 0xb5a576a4 in QObject::event(QEvent*) () from /usr/lib/qt/lib/libQtCore.so.4
#11 0xb5dea8c4 in QApplicationPrivate::notify_helper(QObject*, QEvent*) () from /usr/lib/qt/lib/libQtGui.so.4
#12 0xb5def40e in QApplication::notify(QObject*, QEvent*) () from /usr/lib/qt/lib/libQtGui.so.4
#13 0xb5a4252b in QCoreApplication::notifyInternal(QObject*, QEvent*) () from /usr/lib/qt/lib/libQtCore.so.4
#14 0xb5a7273e in ?? () from /usr/lib/qt/lib/libQtCore.so.4
#15 0xb5a6f497 in ?? () from /usr/lib/qt/lib/libQtCore.so.4
#16 0xb4a17432 in g_main_context_dispatch () from /usr/lib/libglib-2.0.so.0
#17 0xb4a17c10 in ?? () from /usr/lib/libglib-2.0.so.0
#18 0xb4a17ec4 in g_main_context_iteration () from /usr/lib/libglib-2.0.so.0
#19 0xb5a6fbac in QEventDispatcherGlib::processEvents(QFlags) () from /usr/lib/qt/lib/libQtCore.so.4
#20 0xb5e9bad5 in ?? () from /usr/lib/qt/lib/libQtGui.so.4
#21 0xb5a416e9 in QEventLoop::processEvents(QFlags) () from /usr/lib/qt/lib/libQtCore.so.4
#22 0xb5a4198a in QEventLoop::exec(QFlags) () from /usr/lib/qt/lib/libQtCore.so.4
#23 0xb5a463df in QCoreApplication::exec() () from /usr/lib/qt/lib/libQtCore.so.4
#24 0xb5de8727 in QApplication::exec() () from /usr/lib/qt/lib/libQtGui.so.4
#25 0x08071c29 in ?? ()
#26 0xb54cedb6 in __libc_start_main () from /lib/libc.so.6
#27 0x08070991 in ?? () - Nov 30 2011
Massif Visualizer

Developers Apps 21 comments

Score 75.5%
Dec 12 2014
After some tests, i find that the the problem is related to this cmake option line on my build script
-DBUILD_SHARED_LIBS:BOOL=ON
removed this line Massif Visualizer build without problem. Thanks for help! - Nov 21 2011
I have a compilation error on my Slackware 13.37.
This is the console output.


[ 75%] Building CXX object massifdata/CMakeFiles/mv-massifdata.dir/parserprivate.o
Linking CXX shared library ../lib/libmv-massifdata.so
CMakeFiles/mv-massifdata.dir/parserprivate.o: In function `Massif::ParserPrivate::parseheapTreeLeafInternal(QByteArray const&, int)':
parserprivate.cpp:(.text+0x10b6): undefined reference to `Massif::functionInLabel(QString const&)'
collect2: ld returned 1 exit status
make[2]: *** [lib/libmv-massifdata.so] Errore 1
make[1]: *** [massifdata/CMakeFiles/mv-massifdata.dir/all] Errore 2
make: *** [all] Errore 2


- Nov 20 2011
soundKonverter

Audio Extractors/Converters 606 comments

Score 87.6%
Oct 01 2017
Many thanks! :) - Sep 13 2011
The 1.1.0 tarball seem to be corrupted.

> tar xvzf soundkonverter-1.1.0.tar.gz
tar: This is not a tar archive

- Sep 12 2011
L3afpad

Text Editors 16 comments

Score 58.0%
Oct 24 2012
Many thanks! :) - Sep 12 2011
The requested URL /l3afpad/l3afpad-0.8.18.1.3.tar.xz was not found on this server. - Sep 11 2011
Capi City

Board 20 comments

Score 58.6%
Aug 20 2013
Many thanks! - Aug 31 2011
Sorry but for me the Italian transation is broken. THe 0.5.1 Capitalism still show an English interface.
Also the file it.ts seem untranslated!
- Aug 25 2011
ScreenGrab

Screenshot Tools 26 comments

Score 78.6%
Aug 18 2011
Solved it seem that my Cmake option -DBUILD_SHARED_LIBS:BOOL=ON destroy the build.
After remove this option, Screengrab compile without problems! :) - Aug 18 2011
I have a compilation problem on mySlackware 13.37 with Qt-4.7.0.


[ 21%] Building CXX object src/common/qkeysequencewidget/CMakeFiles/qkeysequencewidget.dir/qrc_qkeysequencewidget.cxx.o
Linking CXX shared library libqkeysequencewidget.so
CMakeFiles/qkeysequencewidget.dir/src/moc_qkeysequencewidget.cxx.o: In function `QKeySequenceWidget::metaObject() const':
moc_qkeysequencewidget.cxx:(.text+0x0): multiple definition of `QKeySequenceWidget::metaObject() const'
CMakeFiles/qkeysequencewidget.dir/src/qkeysequencewidget.cpp.o:qkeysequencewidget.cpp:(.text+0x30): first defined here
CMakeFiles/qkeysequencewidget.dir/src/moc_qkeysequencewidget.cxx.o:(.data.rel.ro+0x0): multiple definition of `QKeySequenceWidget::staticMetaObject'
CMakeFiles/qkeysequencewidget.dir/src/qkeysequencewidget.cpp.o:(.data.rel.ro+0x0): first defined here
CMakeFiles/qkeysequencewidget.dir/src/moc_qkeysequencewidget.cxx.o: In function `QKeySequenceWidget::qt_metacast(char const*)':
moc_qkeysequencewidget.cxx:(.text+0x30): multiple definition of `QKeySequenceWidget::qt_metacast(char const*)'
CMakeFiles/qkeysequencewidget.dir/src/qkeysequencewidget.cpp.o:qkeysequencewidget.cpp:(.text+0x60): first defined here
CMakeFiles/qkeysequencewidget.dir/src/moc_qkeysequencewidget.cxx.o: In function `QKeySequenceWidget::keySequenceChanged(QKeySequence const&)':
moc_qkeysequencewidget.cxx:(.text+0xb0): multiple definition of `QKeySequenceWidget::keySequenceChanged(QKeySequence const&)'
CMakeFiles/qkeysequencewidget.dir/src/qkeysequencewidget.cpp.o:qkeysequencewidget.cpp:(.text+0xe00): first defined here
CMakeFiles/qkeysequencewidget.dir/src/moc_qkeysequencewidget.cxx.o: In function `QKeySequenceWidget::keySequenceAccepted(QKeySequence const&)':
moc_qkeysequencewidget.cxx:(.text+0xf0): multiple definition of `QKeySequenceWidget::keySequenceAccepted(QKeySequence const&)'
CMakeFiles/qkeysequencewidget.dir/src/qkeysequencewidget.cpp.o:qkeysequencewidget.cpp:(.text+0xe40): first defined here
CMakeFiles/qkeysequencewidget.dir/src/moc_qkeysequencewidget.cxx.o: In function `QKeySequenceWidget::keySequenceCleared()':
moc_qkeysequencewidget.cxx:(.text+0x130): multiple definition of `QKeySequenceWidget::keySequenceCleared()'
CMakeFiles/qkeysequencewidget.dir/src/qkeysequencewidget.cpp.o:qkeysequencewidget.cpp:(.text+0x1050): first defined here
CMakeFiles/qkeysequencewidget.dir/src/moc_qkeysequencewidget.cxx.o: In function `QKeySequenceWidget::keyNotSupported()':
moc_qkeysequencewidget.cxx:(.text+0x160): multiple definition of `QKeySequenceWidget::keyNotSupported()'
CMakeFiles/qkeysequencewidget.dir/src/qkeysequencewidget.cpp.o:qkeysequencewidget.cpp:(.text+0x1860): first defined here
CMakeFiles/qkeysequencewidget.dir/src/moc_qkeysequencewidget.cxx.o: In function `QKeySequenceWidget::qt_metacall(QMetaObject::Call, int, void**)':
moc_qkeysequencewidget.cxx:(.text+0x190): multiple definition of `QKeySequenceWidget::qt_metacall(QMetaObject::Call, int, void**)'
CMakeFiles/qkeysequencewidget.dir/src/qkeysequencewidget.cpp.o:qkeysequencewidget.cpp:(.text+0x1890): first defined here
CMakeFiles/qkeysequencewidget.dir/qrc_qkeysequencewidget.cxx.o: In function `qInitResources_qkeysequencewidget()':
qrc_qkeysequencewidget.cxx:(.text+0x0): multiple definition of `qInitResources_qkeysequencewidget()'
CMakeFiles/qkeysequencewidget.dir/src/qkeysequencewidget.cpp.o:qkeysequencewidget.cpp:(.text+0x1f20): first defined here
CMakeFiles/qkeysequencewidget.dir/qrc_qkeysequencewidget.cxx.o: In function `qCleanupResources_qkeysequencewidget()':
qrc_qkeysequencewidget.cxx:(.text+0x40): multiple definition of `qCleanupResources_qkeysequencewidget()'
CMakeFiles/qkeysequencewidget.dir/src/qkeysequencewidget.cpp.o:qkeysequencewidget.cpp:(.text+0x1f60): first defined here
CMakeFiles/qkeysequencewidget.dir/qrc_qkeysequencewidget.cxx.o:(.bss+0x0): multiple definition of `qCleanupResources_qkeysequencewidget__dest_instance__'
CMakeFiles/qkeysequencewidget.dir/src/qkeysequencewidget.cpp.o:(.bss+0x0): first defined here
collect2: ld returned 1 exit status
make[2]: *** [src/common/qkeysequencewidget/libqkeysequencewidget.so] Errore 1
- Aug 18 2011
KQRCode

Utilities 27 comments

Score 79.3%
Aug 08 2011
Ok but i think this a packager problem and we talking about only for one extra dependency in the future. If someone don't like some extra dependencies take the source and rebuild the package.
- Aug 11 2011
Yes but with some source package the cmake can check the presence of dependencies and disable the support in automatically (Koffice, Kalarm....ecc)
For the Italian translation yes contact me when you are ready.! :) - Aug 10 2011
Oh yes how can help you for translation? And is not possible tu use Cmakelist options to disable some extra dependencies? - Aug 10 2011
Ok thanks for help. I'm on Slackware 13.37. I have good compiled the 0.6.0 version using only the qrcodec.h from the dev package.
KQRCode work fine but i can see i little bug. It crash when i try to load a random file (Not a qrcode).
And It's necessary to have 3 separate packages for main application, header and plugins.
I made on my Slackware 13.37 only one monolitic package and it will be available as soon as possibile on www.slacky.eu. :) - Aug 10 2011
Ok i'm waiting for 0.6.1 release!:) - Aug 09 2011
Many thanks! :) - Aug 09 2011
i have a compilation problem with new version.
This is the console output
I have qrencode 3.1.1 installed. And the previous version compile without problem.


Scanning dependencies of target kqrcode_automoc
Generating moc_kqrcodewindow.cpp
Generating moc_droplabel.cpp
Generating moc_qrtext.cpp
Generating moc_graphicsview.cpp
[ 0%] Built target kqrcode_automoc
[ 10%] [ 20%] Generating ui_qrtext.h
Generating ui_kqrcode.h
[ 30%] Generating ui_slidewidget.h
Scanning dependencies of target kqrcode
[ 40%] [ 50%] Building CXX object kqrcode/CMakeFiles/kqrcode.dir/kqrcode_automoc.o
Building CXX object kqrcode/CMakeFiles/kqrcode.dir/main.o
In file included from /tmp/txz/kqrcode/kqrcode-0.6.0/build/kqrcode/../../kqrcode/kqrcodewindow.h:64:0,
from /tmp/txz/kqrcode/kqrcode-0.6.0/build/kqrcode/moc_kqrcodewindow.cpp:10,
from /tmp/txz/kqrcode/kqrcode-0.6.0/build/kqrcode/kqrcode_automoc.cpp:4:
/tmp/txz/kqrcode/kqrcode-0.6.0/build/kqrcode/../../kqrcode/qrcodeclistmodel.h:33:21: fatal error: qrcodec.h: File o directory non esistente
compilation terminated.
make[2]: *** [kqrcode/CMakeFiles/kqrcode.dir/kqrcode_automoc.o] Errore 1
make[2]: *** Attesa dei processi non terminati....
- Aug 09 2011
The menu desktop file kqrecode.desktop is bugged.
I have corrected it with Italian voices.

[Desktop Entry]
Terminal=false
Name=KQRCode
GenericName=QR Code application
GenericName=Editor Codici QR
Version=0.4
Comment=Read and create QR codes
Comment[it]=Legge e crea codici QR
Type=Application
Exec=kqrcode
Icon=kqrcode
Categories=Qt;KDE;Utility; - Aug 07 2011
sleek

Audioplayers 20 comments

Score 58.0%
Feb 05 2012

Program received signal SIGSEGV, Segmentation fault.
0x08087977 in QMap<QString, QString>::QMap (this=0xbfffdc7c, other=...) at /usr/lib/qt/include/QtCore/qmap.h:185
185 inline QMap(const QMap<Key, T> &other) : d(other.d)
(gdb) backtrace
#0 0x08087977 in QMap<QString, QString>::QMap (this=0xbfffdc7c, other=...) at /usr/lib/qt/include/QtCore/qmap.h:185
#1 0x080c5650 in Song::apply (this=0x0, tpl=...) at src/song.cpp:161
#2 0x0809cc55 in InetSearch::readEntry (this=0x81d89f8, song=0x0) at src/plugins/text_fetch_base.cpp:260
#3 0x0809e933 in InetSearch::btnEdit_toggled (this=0x81d89f8, edit=true) at src/plugins/text_fetch_base.cpp:450
#4 0x080ce042 in InetSearch::qt_metacall (this=0x81d89f8, _c=QMetaObject::InvokeMetaMethod, _id=2, _a=0xbfffde28) at moc_text_fetch_base.cpp:201
#5 0x080cce1d in Lyrics::qt_metacall (this=0x81d89f8, _c=QMetaObject::InvokeMetaMethod, _id=12, _a=0xbfffde28) at moc_lyrics.cpp:75
#6 0xb5a05b7a in QMetaObject::metacall(QObject*, QMetaObject::Call, int, void**) () from /usr/lib/qt/lib/libQtCore.so.4
#7 0xb5a159bd in QMetaObject::activate(QObject*, QMetaObject const*, int, void**) () from /usr/lib/qt/lib/libQtCore.so.4
#8 0xb649fd89 in QAbstractButton::toggled(bool) () from /usr/lib/qt/lib/libQtGui.so.4
#9 0xb61aeea4 in QAbstractButton::setChecked(bool) () from /usr/lib/qt/lib/libQtGui.so.4
#10 0xb61af3e0 in QAbstractButton::nextCheckState() () from /usr/lib/qt/lib/libQtGui.so.4
#11 0xb61aeae3 in ?? () from /usr/lib/qt/lib/libQtGui.so.4
#12 0xb61aedde in QAbstractButton::mouseReleaseEvent(QMouseEvent*) () from /usr/lib/qt/lib/libQtGui.so.4
#13 0xb5e00b94 in QWidget::event(QEvent*) () from /usr/lib/qt/lib/libQtGui.so.4
#14 0xb61ade1e in QAbstractButton::event(QEvent*) () from /usr/lib/qt/lib/libQtGui.so.4
#15 0xb624de12 in QPushButton::event(QEvent*) () from /usr/lib/qt/lib/libQtGui.so.4
#16 0xb5da78c4 in QApplicationPrivate::notify_helper(QObject*, QEvent*) () from /usr/lib/qt/lib/libQtGui.so.4
#17 0xb5dacfca in QApplication::notify(QObject*, QEvent*) () from /usr/lib/qt/lib/libQtGui.so.4
#18 0xb59ff52b in QCoreApplication::notifyInternal(QObject*, QEvent*) () from /usr/lib/qt/lib/libQtCore.so.4
#19 0xb5da8832 in QApplicationPrivate::sendMouseEvent(QWidget*, QMouseEvent*, QWidget*, QWidget*, QWidget**, QPointer<QWidget>&, bool) ()
from /usr/lib/qt/lib/libQtGui.so.4
#20 0xb5e30aac in ?? () from /usr/lib/qt/lib/libQtGui.so.4
#21 0xb5e2f017 in QApplication::x11ProcessEvent(_XEvent*) () from /usr/lib/qt/lib/libQtGui.so.4
#22 0xb5e58ec2 in ?? () from /usr/lib/qt/lib/libQtGui.so.4
#23 0xb7cca432 in g_main_context_dispatch () from /usr/lib/libglib-2.0.so.0
#24 0xb7ccac10 in ?? () from /usr/lib/libglib-2.0.so.0
#25 0xb7ccaec4 in g_main_context_iteration () from /usr/lib/libglib-2.0.so.0
#26 0xb5a2cbac in QEventDispatcherGlib::processEvents(QFlags<QEventLoop::ProcessEventsFlag>) () from /usr/lib/qt/lib/libQtCore.so.4
#27 0xb5e58ad5 in ?? () from /usr/lib/qt/lib/libQtGui.so.4
#28 0xb59fe6e9 in QEventLoop::processEvents(QFlags<QEventLoop::ProcessEventsFlag>) () from /usr/lib/qt/lib/libQtCore.so.4
#29 0xb59fe98a in QEventLoop::exec(QFlags<QEventLoop::ProcessEventsFlag>) () from /usr/lib/qt/lib/libQtCore.so.4
#30 0xb5a033df in QCoreApplication::exec() () from /usr/lib/qt/lib/libQtCore.so.4
#31 0xb5da5727 in QApplication::exec() () from /usr/lib/qt/lib/libQtGui.so.4
#32 0x0805f52a in main (argc=1, argv=0xbfffef04) at src/main.cpp:99
(gdb)
- Aug 09 2011
Another segfault


Lyrics" ( 1 ) "reading from /root/.lyrics/Nico/The Velvet Underground/Velvet Underground & Nico [Deluxe Edition] Disc 2/Nico/The Velvet Underground - Sunday Morning [Mono Version].txt"
"Lyrics" ( 1 ) "/root/.lyrics/Nico/The Velvet Underground/Velvet Underground & Nico [Deluxe Edition] Disc 2/Nico/The Velvet Underground - Sunday Morning [Mono Version].txt not readable"
"Lyrics" ( 1 ) "Writing lyrics to /root/.lyrics/Nico/The Velvet Underground/Velvet Underground & Nico [Deluxe Edition] Disc 2/Nico/The Velvet Underground - Sunday Morning [Mono Version].txt"
"Lyrics" ( 1 ) "reading from /root/.lyrics/Nico/The Velvet Underground/Velvet Underground & Nico [Deluxe Edition] Disc 2/Nico/The Velvet Underground - Sunday Morning [Mono Version].txt"

Program received signal SIGSEGV, Segmentation fault.
0xb7b52639 in ?? () from /usr/lib/libcurl.so.4
(gdb)
- Aug 09 2011
I hope this is the good gdb trace


(gdb) run
Starting program: /root/Desktop/sleek/sleek
[Thread debugging using libthread_db enabled]
CONFIG_FILE "/root/.sleek///root/.sleek//sleek.config"
No other instance running. Continuing
"/root/.sleek//sleek.config"
[New Thread 0xb2437b70 (LWP 7592)]
[New Thread 0xb1c37b70 (LWP 7593)]
[Thread 0xb2437b70 (LWP 7592) exited]
"volume 100 1"

Program received signal SIGSEGV, Segmentation fault.
0x08087977 in QMap<QString, QString>::QMap (this=0xbfffdc7c, other=...) at /usr/lib/qt/include/QtCore/qmap.h:185
185 inline QMap(const QMap<Key, T> &other) : d(other.d)
- Aug 09 2011
Many thanks Sleek compile fine now.

But i see that it segfault if i touch some button before loading some song file or directory.

./sleek
CONFIG_FILE "/root/.sleek///root/.sleek//sleek.config"
No other instance running. Continuing
"/root/.sleek//sleek.config"
"volume 100 1"
Segmentation fault

After loading some song it work without problem. But i cannot get album cover on songinfo window.
- Aug 09 2011
Many thanks Sleek compile fine now.

But i see that it segfault if i touch some button before loading some song file or directory.

./sleek
CONFIG_FILE "/root/.sleek///root/.sleek//sleek.config"
No other instance running. Continuing
"/root/.sleek//sleek.config"
"volume 100 1"
Segmentation fault

After loading some song it work without problem. But i cannot get album cover on songinfo window.
- Aug 09 2011
Many thanks Sleek compile fine now.

But i see that it segfault if i touch some button before loading some song file or directory.

./sleek
CONFIG_FILE "/root/.sleek///root/.sleek//sleek.config"
No other instance running. Continuing
"/root/.sleek//sleek.config"
"volume 100 1"
Segmentation fault

After loading some song it work without problem. But i cannot get album cover on songinfo window.
- Aug 09 2011
Many thanks Sleek compile fine now.

But i see that it segfault if i touch some button before loading some song file or directory.

./sleek
CONFIG_FILE "/root/.sleek///root/.sleek//sleek.config"
No other instance running. Continuing
"/root/.sleek//sleek.config"
"volume 100 1"
Segmentation fault

After loading some song it work without problem. But i cannot get album cover on songinfo window.
- Aug 09 2011
Many thanks Sleek compile fine now.

But i see that it segfault if i touch some button before loading some song file or directory.

./sleek
CONFIG_FILE "/root/.sleek///root/.sleek//sleek.config"
No other instance running. Continuing
"/root/.sleek//sleek.config"
"volume 100 1"
Segmentation fault

After loading some song it work without problem. But i cannot get album cover on songinfo window.
- Aug 09 2011
New error! I removed some debug lines because repetitive.

1> qmake
sed: impossibile leggere : File o directory non esistente
sed: impossibile leggere : File o directory non esistente
sed: impossibile leggere : File o directory non esistente
sed: impossibile leggere : File o directory non esistente
sed: impossibile leggere : File o directory non esistente
sed: impossibile leggere : File o directory non esistente
sed: impossibile leggere : File o directory non esistente
Project MESSAGE: Found libgstreamer-0.10
Project MESSAGE: Found libvlc

2> make
/usr/lib/qt/bin/uic ui/lyrics_tester.ui -o ui_lyrics_tester.h
/usr/lib/qt/bin/uic ui/mainwindow.ui -o ui_mainwindow.h
/usr/lib/qt/bin/uic ui/lastfm.ui -o ui_lastfm.h
/usr/lib/qt/bin/uic ui/webinfo.ui -o ui_webinfo.h
/usr/lib/qt/bin/uic ui/songproperties.ui -o ui_songproperties.h
/usr/lib/qt/bin/uic ui/playcontrol.ui -o ui_playcontrol.h
/usr/lib/qt/bin/uic ui/lyrics.ui -o ui_lyrics.h
/usr/lib/qt/bin/uic ui/transcriber.ui -o ui_transcriber.h
/usr/lib/qt/bin/uic ui/winsettings.ui -o ui_winsettings.h

g++ -c -pipe -O2 -march=i486 -mtune=i686 -Wall -W -D_REENTRANT -DPLAYLIST_INDEX=1 -DBACKEND_GSTREAMER=1 -DBACKEND_VLC=1 -DBACKEND_MPLAYER=1 -DUSE_DBUS=1 -DBACKEND_PHONON=1 -DQT_NO_DEBUG -DQT_WEBKIT_LIB -DQT_PHONON_LIB -DQT_DBUS_LIB -DQT_XML_LIB -DQT_GUI_LIB -DQT_NETWORK_LIB -DQT_CORE_LIB -DQT_SHARED -I/usr/lib/qt/mkspecs/linux-g++ -I. -I/usr/lib/qt/include/QtCore -I/usr/lib/qt/include/QtNetwork -I/usr/lib/qt/include/QtGui -I/usr/lib/qt/include/QtXml -I/usr/lib/qt/include/QtDBus -I/usr/lib/qt/include/phonon -I/usr/lib/qt/include/QtWebKit -I/usr/lib/qt/include -I-pthread -I/usr/include/gstreamer-0.10 -I/usr/include/glib-2.0 -I/usr/lib/glib-2.0/include -I/usr/include/libxml2 -I-D_REENTRANT -I/usr/include/liblastfm -I/usr/include/taglib -I. -I/usr/lib/qt/include/phonon_compat -I. -o library.o src/plugins/library.cpp
g++ -c -pipe -O2 -march=i486 -mtune=i686 -Wall -W -D_REENTRANT -DPLAYLIST_INDEX=1 -DBACKEND_GSTREAMER=1 -DBACKEND_VLC=1 -DBACKEND_MPLAYER=1 -DUSE_DBUS=1 -DBACKEND_PHONON=1 -DQT_NO_DEBUG -DQT_WEBKIT_LIB -DQT_PHONON_LIB -DQT_DBUS_LIB -DQT_XML_LIB -DQT_GUI_LIB -DQT_NETWORK_LIB -DQT_CORE_LIB -DQT_SHARED -I/usr/lib/qt/mkspecs/linux-g++ -I. -I/usr/lib/qt/include/QtCore -I/usr/lib/qt/include/QtNetwork -I/usr/lib/qt/include/QtGui -I/usr/lib/qt/include/QtXml -I/usr/lib/qt/include/QtDBus -I/usr/lib/qt/include/phonon -I/usr/lib/qt/include/QtWebKit -I/usr/lib/qt/include -I-pthread -I/usr/include/gstreamer-0.10 -I/usr/include/glib-2.0 -I/usr/lib/glib-2.0/include -I/usr/include/libxml2 -I-D_REENTRANT -I/usr/include/liblastfm -I/usr/include/taglib -I. -I/usr/lib/qt/include/phonon_compat -I. -o lastfm.o src/plugins/lastfm.cpp
src/plugins/lastfm.cpp:315:26: fatal error: lastfm_data.h: File o directory non esistente


- Aug 09 2011
Yes...

1> qmake

find: "dbus/*.xml": File o directory non esistente
ls: impossibile accedere a /root/Desktop/sleek/dbus/*.xml: File o directory non esistente
Project MESSAGE: Found libvlc
Project MESSAGE: Found liblastfm
Project MESSAGE: Found libtag
Project MESSAGE: Found libcurl

2> make

make
/usr/lib/qt/bin/uic ui/lyrics_tester.ui -o ui_lyrics_tester.h
/usr/lib/qt/bin/uic ui/mainwindow.ui -o ui_mainwindow.h
/usr/lib/qt/bin/uic ui/lastfm.ui -o ui_lastfm.h
/usr/lib/qt/bin/uic ui/webinfo.ui -o ui_webinfo.h
/usr/lib/qt/bin/uic ui/songproperties.ui -o ui_songproperties.h
/usr/lib/qt/bin/uic ui/playcontrol.ui -o ui_playcontrol.h
/usr/lib/qt/bin/uic ui/lyrics.ui -o ui_lyrics.h
/usr/lib/qt/bin/uic ui/transcriber.ui -o ui_transcriber.h
/usr/lib/qt/bin/uic ui/winsettings.ui -o ui_winsettings.h
g++ -c -pipe -g -Wall -W -D_REENTRANT -DPLAYLIST_INDEX=1 -DBACKEND_GSTREAMER=1 -DBACKEND_VLC=1 -DBACKEND_MPLAYER=1 -DUSE_DBUS=1 -DBACKEND_PHONON=1 -DQT_WEBKIT_LIB -DQT_PHONON_LIB -DQT_DBUS_LIB -DQT_XML_LIB -DQT_GUI_LIB -DQT_NETWORK_LIB -DQT_CORE_LIB -DQT_SHARED -I/usr/lib/qt/mkspecs/linux-g++ -I. -I/usr/lib/qt/include/QtCore -I/usr/lib/qt/include/QtNetwork -I/usr/lib/qt/include/QtGui -I/usr/lib/qt/include/QtXml -I/usr/lib/qt/include/QtDBus -I/usr/lib/qt/include/phonon -I/usr/lib/qt/include/QtWebKit -I/usr/lib/qt/include -I-pthread -I/usr/include/gstreamer-0.10 -I/usr/include/glib-2.0 -I/usr/lib/glib-2.0/include -I/usr/include/libxml2 -I. -I/usr/lib/qt/include/phonon_compat -I. -o config.o src/config.cpp
g++ -c -pipe -g -Wall -W -D_REENTRANT -DPLAYLIST_INDEX=1 -DBACKEND_GSTREAMER=1 -DBACKEND_VLC=1 -DBACKEND_MPLAYER=1 -DUSE_DBUS=1 -DBACKEND_PHONON=1 -DQT_WEBKIT_LIB -DQT_PHONON_LIB -DQT_DBUS_LIB -DQT_XML_LIB -DQT_GUI_LIB -DQT_NETWORK_LIB -DQT_CORE_LIB -DQT_SHARED -I/usr/lib/qt/mkspecs/linux-g++ -I. -I/usr/lib/qt/include/QtCore -I/usr/lib/qt/include/QtNetwork -I/usr/lib/qt/include/QtGui -I/usr/lib/qt/include/QtXml -I/usr/lib/qt/include/QtDBus -I/usr/lib/qt/include/phonon -I/usr/lib/qt/include/QtWebKit -I/usr/lib/qt/include -I-pthread -I/usr/include/gstreamer-0.10 -I/usr/include/glib-2.0 -I/usr/lib/glib-2.0/include -I/usr/include/libxml2 -I. -I/usr/lib/qt/include/phonon_compat -I. -o player.o src/player.cpp
src/player.cpp:4:29: fatal error: player_adaptor.h: File o directory non esistente
compilation terminated.
make: *** [player.o] Errore 1



- Aug 08 2011
I have a compilation problem on my Slackware 13.37.
This is the console output.

src/player.cpp:4:29: fatal error: player_adaptor.h: - Aug 08 2011
gSharkDown

Audio Apps 18 comments

Score 74.0%
Jan 01 2012
Sorry the Italian translation work now. I have missed the locale directory inside my Slackware package on www.slacky.eu.
- Aug 08 2011
Just for test i have downloaded the latest source. But the GUI still show English localization.
All the others GTK apps show correctly the Italian localization. - Aug 07 2011
Good let me know if it's ok. - Aug 06 2011
Sorry but there is no attach button on the linked page on BitBucket. - Aug 06 2011
I man i have the Italian translation, but i don't know how to send to you.
Also i have a problem with Launchpad, i don't understand how does it work. :) - Aug 05 2011
Many thanks!:) - Jul 28 2011
With this new version Gshardown fail to run.
I have a script wrapper under /usr/bin. This script run the main program under /usr/share/gsharkdown.

( #!/bin/bash

cd /usr/share/gsharkdown && ./gsharkdown.py )

The problem is that when i try to run Gshardown exit with this error

gsharkdown
** Message: pygobject_register_sinkfunc is deprecated (GstObject)
Traceback (most recent call last):
File "./gsharkdown.py", line 685, in <module>
APP = SharkDown()
File "./gsharkdown.py", line 129, in __init__
self.check_for_update(None)
File "./gsharkdown.py", line 200, in check_for_update
local = open('%s/VERSION' % BASEPATH, 'r')
IOError: [Errno 2] File o directory non esistente: '/usr/share/gsharkdown/VERSION'

But it run correctly if i try to run it, inside the /usr/share/gshardown directory.


- Jul 27 2011
KBookOCR

Office Apps 54 comments

by b0noI
Score 76.3%
Jul 18 2011
Many thanks KBookocr compile and work fine now! - Jul 19 2011
This new version fail to compile on my Slackware 13.37.

viewadder.cpp:33:6: warning: unused parameter ‘doc’
viewadder.cpp:33:6: warning: unused parameter ‘n’
g++ -c -O2 -march=i486 -mtune=i686 -O2 -march=i486 -mtune=i686 -Wall -W -D_REENTRANT -DQT_NO_DEBUG -DQT_GUI_LIB -DQT_CORE_LIB -DQT_SHARED -I/usr/lib/qt/mkspecs/linux-g++ -I. -I/usr/lib/qt/include/QtCore -I/usr/lib/qt/include/QtGui -I/usr/lib/qt/include -I/usr/include/poppler/qt4 -I. -I. -o scanerdialog.o scanerdialog.cpp
scanerdialog.cpp:2:29: fatal error: ui_scanerdialog.h: File o directory non esistente
compilation terminated.
make: *** [scanerdialog.o] Errore 1
make: *** Attesa dei processi non terminati....
ocrthread.cpp: In member function ‘bool OCRThread::startOCR()’:
ocrthread.cpp:168:1: warning: no return statement in function returning non-void
ocrthread.cpp: In member function ‘QString OCRThread::getImgAt(int)’:
ocrthread.cpp:238:1: warning: control reaches end of non-void function
- Jul 17 2011
Feff

Video Apps 75 comments

Score 75.5%
May 26 2013
Sorry i'm talking about feff.ico. I'm using it to build a menu desktop voice for a Slackware package.

http://repository.slacky.eu/slackware-13.37/multimedia/feff/1.6/src/ - Jul 18 2011
Solved, the translations files need to be generated by lrelease *.ts.
Take a look that the Italian translations strings overwrite the GUI.
http://img10.imageshack.us/i/schermata1e.png/

Please: Change the menu icon!:)

- Jun 28 2011
FeFF 1.6 work now but the gui is still localized in English only.
- Jun 28 2011
Lyrics

Audio Apps 3 comments

by sinis
Score 58.0%
Jun 28 2011
Many thanks! - Jun 28 2011
QTGZManager

System Software
by aarnt

Score 70.0%
9   Nov 04 2012
QMPlay2

Video Players
by zaps166

Score 79.2%
9   Oct 30 2012
glnemo2

Science
by jcldc13

Score 61.7%
9   Feb 15 2012
getMediaInfo

Dolphin Service Menus
by kdekda

Score 80.8%
9   Jan 05 2012
Attach to thunderbird

Dolphin Service Menus
by danux

Score 71.7%
9   Nov 17 2011
kde-service-menu-vlc

Dolphin Service Menus
by nowardev

Score 76.7%
9   Nov 10 2011
Score 75.8%
9   Nov 09 2011
qMetro

Utilities
by NoIdea

Score 79.3%
9   Nov 07 2011
Score 72.2%
9   Nov 01 2011
kifxofx

Financial
by gnome71

Score 50.0%
9   Oct 25 2011
Score 74.0%
9   Oct 25 2011
Synfig

Vector Graphics
by Genete

Score 70.0%
9   Sep 30 2011
Kaption

Graphic Apps
by bardack

Score 84.5%
9   Sep 15 2011
zNotes

Notes
by ru-proton

Score 68.8%
9   Aug 27 2011
QuadKonsole4

System Software
by kbo

Score 76.7%
9   Aug 19 2011
ScreenGrab

Screenshot Tools
by DOOMer

Score 78.6%
9   Aug 18 2011
Transcoder

Video Apps
by chelovek84

Score 63.3%
9   Aug 17 2011
KTorrent

Network
by George666

Score 86.3%
9   Aug 17 2011
EKO sound editor

Music Production
by xornot

Score 72.2%
9   Aug 03 2011
Auralquiz

Various Games
by JanKusanagi

Score 74.0%
9   Jul 26 2011
QtCumber

Network
by Neroniuos

Score 70.0%
9   Jul 21 2011
gnoduino

Developers Apps
by cooly

Score 67.1%
9   Jul 19 2011
KBookOCR

Office Apps
by b0noI

Score 76.3%
9   Jul 18 2011
GParted

Utilities
by gedakc

Score 80.8%
9   Jul 18 2011
Feff

Video Apps
by admsasha

Score 75.5%
9   Jul 18 2011
KQRCode

Utilities
by TheShadow

Score 79.3%
9   Jul 18 2011
K Raid Monitor

System Software
by gustl

Score 58.0%
9   Jul 18 2011
gSharkDown

Audio Apps
by vkolev

Score 74.0%
9   Jul 15 2011
Oxygen KDE (Firefox Theme)

Various KDE 1.-4. Improvements
by jimmy88

Score 87.0%
9   Jun 30 2011
gnurpgm

Various Games
by axed

Score 74.0%
9   Jun 29 2011
Color Folder

Dolphin Service Menus
by HessiJames

Score 80.9%
9   Jun 28 2011
Score 76.7%
9   Jun 28 2011
Lyrics

Audio Apps
by sinis

Score 58.0%
9   Jun 28 2011
Scan with ClamAV (extended)

Dolphin Service Menus
by Incarus

Score 79.2%
9   Jun 26 2011
Kamerka

Graphic Apps
by dos1

Score 83.6%
9   Jun 07 2011
TEA text editor

Text Editors
by xornot

Score 74.4%
9   Dec 27 2010
Score 53.3%
9   Dec 26 2010
2ManDVD

Utilities
by csgib

Score 73.3%
9   Dec 12 2010
guitone

Developers Apps
by tommyd3mdi

Score 58.0%
9   Nov 09 2010
EasyImageSizer

Graphic Apps
by FalseCAM

Score 58.0%
9   Nov 09 2010
Televideo

Browser
by Klenje

Score 58.0%
9   Nov 09 2010
WatchVideo

Browser
by fr33mind

Score 65.6%
9   Nov 06 2010