Image 01
profile-image

kejos

Bartosz Szewczyk
oxygen-transparent

QtCurve 546 comments

Score 81.0%
Jan 08 2013
It would appear that even when i'm building oxygen-transparent with --branch stable I keep having an error:
I'm Using Kubntu 12.10 with Kde 4.9.2

[ 14%] Building CXX object decoration/CMakeFiles/kwin3_oxygen_transparent.dir/oxygenbutton.o
In file included from /home/i1szewczyk/oxygen-transparent/src/decoration/oxygenbutton.cpp:30:0:
/home/i1szewczyk/oxygen-transparent/src/decoration/oxygenclient.h: In member function ‘bool Oxygen::Client::isForcedActive() const’:
/home/i1szewczyk/oxygen-transparent/src/decoration/oxygenclient.h:92:51: error: ‘clientGroupItems’ was not declared in this scope
/home/i1szewczyk/oxygen-transparent/src/decoration/oxygenclient.h: In member function ‘bool Oxygen::Client::hideTitleBar() const’:
/home/i1szewczyk/oxygen-transparent/src/decoration/oxygenclient.h:119:34: error: ‘clientGroupItems’ was not declared in this scope
In file included from /home/i1szewczyk/oxygen-transparent/src/decoration/oxygenbutton.cpp:30:0:
/home/i1szewczyk/oxygen-transparent/src/decoration/oxygenclient.h: In member function ‘bool Oxygen::Client::hasTitleOutline() const’:
/home/i1szewczyk/oxygen-transparent/src/decoration/oxygenclient.h:365:34: error: ‘clientGroupItems’ was not declared in this scope
In file included from /home/i1szewczyk/oxygen-transparent/src/decoration/oxygenbutton.cpp:30:0:
/home/i1szewczyk/oxygen-transparent/src/decoration/oxygenclient.h: In member function ‘bool Oxygen::Client::hideTitleBar() const’:
/home/i1szewczyk/oxygen-transparent/src/decoration/oxygenclient.h:120:9: error: control reaches end of non-void function [-Werror=return-type]
/home/i1szewczyk/oxygen-transparent/src/decoration/oxygenclient.h: In member function ‘bool Oxygen::Client::isForcedActive() const’:
/home/i1szewczyk/oxygen-transparent/src/decoration/oxygenclient.h:92:66: error: control reaches end of non-void function [-Werror=return-type]
cc1plus: some warnings being treated as errors
make[2]: *** [decoration/CMakeFiles/kwin3_oxygen_transparent.dir/oxygenbutton.o] error 1
make[1]: *** [decoration/CMakeFiles/kwin3_oxygen_transparent.dir/all] error 2
make: *** [all] error 2 - Nov 22 2012