Image 01
profile-image

musicmaker

Dmitry Novikoff
Wallpaper Other
Gimp Splashes
KDE 3.x Splash Screens
Nature
K3b Themes
Various Stuff
Wallpapers KDE Plasma
VistaPalm

Wallpaper Other 1 comment

Rating: 4.6
Nov 25 2006
I don't think what it is legacy wallpaper :) - Nov 25 2006
Zen Balloons Bis

Wallpaper Other 1 comment

Rating: 6.1
Sep 03 2006
/// but horisontal stripes is no good... meybe 45 degress stripes? - Sep 03 2006
MacSlow\'s Cairo-Clock

Various Gnome Stuff 45 comments

Rating: 6.9
Apr 01 2006
Please make package for SuSE linux///
I can't build this :( - Aug 30 2006
Polyester

KDE 3.5 Themes 395 comments

by mart
Rating: 6.8
Feb 17 2009
SUBJ. please build it - Jan 16 2006
SuSE 9.3 error!

-----------------------
polymer.moc:56: error: variable `const
polymerButton::QConnection::~QConnection()::QUMethod slot_1' has initializer
but incomplete type
polymer.moc:57: error: variable `const
polymerButton::QConnection::~QConnection()::QUMethod slot_2' has initializer
but incomplete type
polymer.moc:59: error: incomplete type `QMetaData' does not have member `
Protected'
polymer.moc:60: error: incomplete type `QMetaData' does not have member `
Protected'
polymer.moc:61: error: incomplete type `QMetaData' does not have member `
Protected'
polymer.moc:62: error: elements of array `const QMetaData slot_tbl[]' have
incomplete type
polymer.moc:62: error: uninitialized const `slot_tbl'
polymer.moc:62: error: storage size of `slot_tbl' isn't known
polymer.moc:71: error: incomplete type 'QMetaObject' cannot be used to name a
scope
polymer.moc:72: error: `cleanUp_polymer__polymerButton' undeclared (first use
this function)
polymer.moc:76: error: no class template named `polymerButton' in `polymer'
polymer.moc: In function `void* qt_cast(const char*)':
polymer.moc:79: error: invalid use of `this' in non-member function
polymer.moc:80: error: cannot call member function `virtual void*
QButton::qt_cast(const char*)' without object
polymer.moc:83: error: no class template named `polymerButton' in `polymer'
polymer.moc: In function `bool qt_invoke(int, QUObject*)':
polymer.moc:85: error: `slotOffset' undeclared (first use this function)
polymer.moc:86: error: `animate' undeclared (first use this function)
polymer.moc:87: error: `buttonClicked' undeclared (first use this function)
polymer.moc:88: error: `buttonReleased' undeclared (first use this function)
polymer.moc:90: error: cannot call member function `virtual bool
QButton::qt_invoke(int, QUObject*)' without object
polymer.moc:95: error: no class template named `polymerButton' in `polymer'
polymer.moc: In function `bool qt_emit(int, QUObject*)':
polymer.moc:97: error: cannot call member function `virtual bool
QButton::qt_emit(int, QUObject*)' without object
polymer.moc:101: error: no class template named `polymerButton' in `polymer'
polymer.moc: In function `bool qt_property(int, int, QVariant*)':
polymer.moc:103: error: cannot call member function `virtual bool
QButton::qt_property(int, int, QVariant*)' without object
polymer.moc:106: error: no class template named `polymerButton' in `polymer'
polymer.moc: In function `bool qt_static_property(QObject*, int, int,
QVariant*)':
polymer.moc:111: error: invalid use of undefined type `struct
polymer::polymerClient'
polymer.h:42: error: forward declaration of `struct polymer::polymerClient'
polymer.moc: In member function `const char*
polymer::polymerClient::className() const':
polymer.moc:115: error: invalid use of undefined type `struct
polymer::polymerClient'
polymer.h:42: error: forward declaration of `struct polymer::polymerClient'
polymer.moc:115: error: assignment (not initialization) in declaration
polymer.moc:116: error: incomplete type `polymer::polymerClient' does not have
member `staticMetaObject'
polymer.moc:116: confused by earlier errors, bailing out
make[3]: *** [polymer.lo] Ошибка 1
make[3]: Leaving directory `/usr/src/polymer/client'
make[2]: *** [all-recursive] Ошибка 1
make[2]: Leaving directory `/usr/src/polymer/client'
make[1]: *** [all-recursive] Ошибка 1
make[1]: Leaving directory `/usr/src/polymer'
make: *** [all] Ошибка 2

-------------------------------

please, make suse.rpm package
- Oct 13 2005
Polymer SuSE RPM

KDE 3.5 Themes 4 comments

by patch
Rating: 6.1
Oct 14 2005
It's my favourite theme! (after baghira and linspire) - Oct 14 2005
Crystal-GL

KDE 3.x Window Decorations 175 comments

Rating: 6.8
Jan 26 2005
don't work :(
When I select crystal gl - kkontrol was crashed!

Open GL is enabled
Video - NVidia GeForce 6600 - Sep 27 2005